Text only
15 Aug 2009
 
 
Tools: wrap/unwrap  
  1
  2
  3
  4
  5
  6
  7
  8
  9
 10
 11
 12
 13
 14
 15
 16
 17
 18
 19
 20
 21
 22
 23
 24
 25
 26
 27
 28
 29
 30
 31
 32
 33
 34
 35
 36
 37
 38
 39
 40
 41
 42
 43
 44
 45
 46
 47
 48
 49
 50
 51
 52
 53
 54
 55
 56
 57
 58
 59
 60
 61
 62
 63
 64
 65
 66
 67
 68
 69
 70
 71
 72
 73
 74
 75
 76
 77
 78
 79
 80
 81
 82
 83
 84
 85
 86
 87
 88
 89
 90
 91
 92
 93
 94
 95
 96
 97
 98
 99
100
101
102
103
104
105
106
107
108
109
110
111
112
113
114
115
116
117
118
119
120
121
122
123
124
125
126
127
128
129
130
131
132
133
134
135
136
137
138
139
140
141
142
143
144
145
146
147
148
149
150
151
152
153
154
155
156
157
158
159
160
161
162
163
164
165
166
167
168
169
170
171
172
173
174
175
176
177
178
179
180
181
182
183
184
185
186
187
188
189
190
191
192
193
194
195
196
197
198
199
200
201
202
203
204
205
206
207
208
209
210
211
212
213
214
215
216
217
218
219
220
221
222
223
224
225
226
227
228
229
230
231
232
233
234
235
236
237
238
server:/usr/src/linux-2.6.30.4 # make xconfig
HOSTCC scripts/basic/fixdep
In file included from scripts/basic/fixdep.c:107:
/usr/include/sys/types.h:147:20: error: stddef.h: Нет такого файла или каталога
In file included from scripts/basic/fixdep.c:109:
/usr/include/sys/mman.h:58: error: expected declaration specifiers or ‘...’ before ‘size_t’
/usr/include/sys/mman.h:77: error: expected declaration specifiers or ‘...’ before ‘size_t’
/usr/include/sys/mman.h:82: error: expected declaration specifiers or ‘...’ before ‘size_t’
/usr/include/sys/mman.h:90: error: expected declaration specifiers or ‘...’ before ‘size_t’
/usr/include/sys/mman.h:95: error: expected declaration specifiers or ‘...’ before ‘size_t’
/usr/include/sys/mman.h:99: error: expected declaration specifiers or ‘...’ before ‘size_t’
/usr/include/sys/mman.h:104: error: expected declaration specifiers or ‘...’ before ‘size_t’
/usr/include/sys/mman.h:107: error: expected declaration specifiers or ‘...’ before ‘size_t’
/usr/include/sys/mman.h:124: error: expected declaration specifiers or ‘...’ before ‘size_t’
In file included from scripts/basic/fixdep.c:110:
/usr/include/unistd.h:327: error: expected declaration specifiers or ‘...’ before ‘size_t’
/usr/include/unistd.h:333: error: expected declaration specifiers or ‘...’ before ‘size_t’
/usr/include/unistd.h:477: error: expected declaration specifiers or ‘...’ before ‘size_t’
In file included from scripts/basic/fixdep.c:110:
/usr/include/unistd.h:580: error: expected ‘=’, ‘,’, ‘;’, ‘asm’ or ‘__attribute__’ before ‘confstr’
/usr/include/unistd.h:752: error: expected declaration specifiers or ‘...’ before ‘size_t’
/usr/include/unistd.h:788: error: expected declaration specifiers or ‘...’ before ‘size_t’
/usr/include/unistd.h:835: error: expected declaration specifiers or ‘...’ before ‘size_t’
In file included from scripts/basic/fixdep.c:110:
/usr/include/unistd.h:857: error: expected declaration specifiers or ‘...’ before ‘size_t’
/usr/include/unistd.h:864: error: expected declaration specifiers or ‘...’ before ‘size_t’
/usr/include/unistd.h:875: error: expected declaration specifiers or ‘...’ before ‘size_t’
/usr/include/unistd.h:877: error: expected declaration specifiers or ‘...’ before ‘size_t’
/usr/include/unistd.h:895: error: expected declaration specifiers or ‘...’ before ‘size_t’
/usr/include/unistd.h:896: error: expected declaration specifiers or ‘...’ before ‘size_t’
In file included from scripts/basic/fixdep.c:112:
/usr/include/string.h:39: error: expected declaration specifiers or ‘...’ before ‘size_t’
/usr/include/string.h:43: error: expected declaration specifiers or ‘...’ before ‘size_t’
/usr/include/string.h:52: error: expected declaration specifiers or ‘...’ before ‘size_t’
/usr/include/string.h:59: error: expected declaration specifiers or ‘...’ before ‘size_t’
/usr/include/string.h:62: error: expected declaration specifiers or ‘...’ before ‘size_t’
/usr/include/string.h:66: error: expected declaration specifiers or ‘...’ before ‘size_t’
/usr/include/string.h:88: error: expected declaration specifiers or ‘...’ before ‘size_t’
/usr/include/string.h:96: error: expected declaration specifiers or ‘...’ before ‘size_t’
/usr/include/string.h:102: error: expected declaration specifiers or ‘...’ before ‘size_t’
/usr/include/string.h:109: error: expected ‘=’, ‘,’, ‘;’, ‘asm’ or ‘__attribute__’ before ‘strxfrm’
/usr/include/string.h:184: error: expected ‘=’, ‘,’, ‘;’, ‘asm’ or ‘__attribute__’ before ‘strcspn’
/usr/include/string.h:188: error: expected ‘=’, ‘,’, ‘;’, ‘asm’ or ‘__attribute__’ before ‘strspn’
/usr/include/string.h:242: error: expected ‘=’, ‘,’, ‘;’, ‘asm’ or ‘__attribute__’ before ‘strlen’
/usr/include/string.h:270: error: expected declaration specifiers or ‘...’ before ‘size_t’
/usr/include/string.h:294: error: expected declaration specifiers or ‘...’ before ‘size_t’
/usr/include/string.h:298: error: expected declaration specifiers or ‘...’ before ‘size_t’
/usr/include/string.h:302: error: expected declaration specifiers or ‘...’ before ‘size_t’
/usr/include/string.h:305: error: expected declaration specifiers or ‘...’ before ‘size_t’
/usr/include/string.h:335: error: expected declaration specifiers or ‘...’ before ‘size_t’
In file included from /usr/include/string.h:423,
from scripts/basic/fixdep.c:112:
/usr/include/bits/string2.h:969: error: expected ‘=’, ‘,’, ‘;’, ‘asm’ or ‘__attribute__’ before ‘__strcspn_c1’
/usr/include/bits/string2.h:971: error: expected ‘=’, ‘,’, ‘;’, ‘asm’ or ‘__attribute__’ before ‘__strcspn_c1’
/usr/include/bits/string2.h:979: error: expected ‘=’, ‘,’, ‘;’, ‘asm’ or ‘__attribute__’ before ‘__strcspn_c2’
/usr/include/bits/string2.h:982: error: expected ‘=’, ‘,’, ‘;’, ‘asm’ or ‘__attribute__’ before ‘__strcspn_c2’
/usr/include/bits/string2.h:991: error: expected ‘=’, ‘,’, ‘;’, ‘asm’ or ‘__attribute__’ before ‘__strcspn_c3’
/usr/include/bits/string2.h:994: error: expected ‘=’, ‘,’, ‘;’, ‘asm’ or ‘__attribute__’ before ‘__strcspn_c3’
/usr/include/bits/string2.h:1045: error: expected ‘=’, ‘,’, ‘;’, ‘asm’ or ‘__attribute__’ before ‘__strspn_c1’
/usr/include/bits/string2.h:1047: error: expected ‘=’, ‘,’, ‘;’, ‘asm’ or ‘__attribute__’ before ‘__strspn_c1’
/usr/include/bits/string2.h:1056: error: expected ‘=’, ‘,’, ‘;’, ‘asm’ or ‘__attribute__’ before ‘__strspn_c2’
/usr/include/bits/string2.h:1059: error: expected ‘=’, ‘,’, ‘;’, ‘asm’ or ‘__attribute__’ before ‘__strspn_c2’
/usr/include/bits/string2.h:1068: error: expected ‘=’, ‘,’, ‘;’, ‘asm’ or ‘__attribute__’ before ‘__strspn_c3’
/usr/include/bits/string2.h:1071: error: expected ‘=’, ‘,’, ‘;’, ‘asm’ or ‘__attribute__’ before ‘__strspn_c3’
/usr/include/bits/string2.h: In function ‘__strpbrk_c2’:
/usr/include/bits/string2.h:1129: error: ‘NULL’ undeclared (first use in this function)
/usr/include/bits/string2.h:1129: error: (Each undeclared identifier is reported only once
/usr/include/bits/string2.h:1129: error: for each function it appears in.)
/usr/include/bits/string2.h:1129: error: ‘size_t’ undeclared (first use in this function)
/usr/include/bits/string2.h:1129: error: expected ‘;’ before ‘__s’
/usr/include/bits/string2.h: In function ‘__strpbrk_c3’:
/usr/include/bits/string2.h:1142: error: ‘NULL’ undeclared (first use in this function)
/usr/include/bits/string2.h:1142: error: ‘size_t’ undeclared (first use in this function)
/usr/include/bits/string2.h:1142: error: expected ‘;’ before ‘__s’
/usr/include/bits/string2.h: In function ‘__strtok_r_1c’:
/usr/include/bits/string2.h:1177: error: ‘NULL’ undeclared (first use in this function)
/usr/include/bits/string2.h: In function ‘__strsep_1c’:
/usr/include/bits/string2.h:1227: error: ‘NULL’ undeclared (first use in this function)
/usr/include/bits/string2.h: In function ‘__strsep_2c’:
/usr/include/bits/string2.h:1237: error: ‘NULL’ undeclared (first use in this function)
/usr/include/bits/string2.h: In function ‘__strsep_3c’:
/usr/include/bits/string2.h:1265: error: ‘NULL’ undeclared (first use in this function)
In file included from /usr/include/bits/string2.h:1298,
from /usr/include/string.h:423,
from scripts/basic/fixdep.c:112:
/usr/include/stdlib.h: At top level:
/usr/include/stdlib.h:471: error: expected ‘)’ before ‘__size’
/usr/include/stdlib.h:473: error: expected ‘)’ before ‘__nmemb’
In file included from /usr/include/string.h:423,
from scripts/basic/fixdep.c:112:
/usr/include/bits/string2.h:1322: error: expected declaration specifiers or ‘...’ before ‘size_t’
In file included from scripts/basic/fixdep.c:113:
/usr/include/stdlib.h:140: error: expected ‘=’, ‘,’, ‘;’, ‘asm’ or ‘__attribute__’ before ‘__ctype_get_mb_cur_max’
/usr/include/stdlib.h: In function ‘atof’:
/usr/include/stdlib.h:281: error: ‘NULL’ undeclared (first use in this function)
/usr/include/stdlib.h: In function ‘atoi’:
/usr/include/stdlib.h:286: error: ‘NULL’ undeclared (first use in this function)
/usr/include/stdlib.h: In function ‘atol’:
/usr/include/stdlib.h:291: error: ‘NULL’ undeclared (first use in this function)
/usr/include/stdlib.h: In function ‘atoll’:
/usr/include/stdlib.h:300: error: ‘NULL’ undeclared (first use in this function)
/usr/include/stdlib.h: At top level:
/usr/include/stdlib.h:337: error: expected declaration specifiers or ‘...’ before ‘size_t’
/usr/include/stdlib.h:367: error: expected declaration specifiers or ‘...’ before ‘size_t’
/usr/include/stdlib.h:369: error: nonnull argument with out-of-range operand number (argument 1, operand 4)
/usr/include/stdlib.h:485: error: expected declaration specifiers or ‘...’ before ‘size_t’
In file included from /usr/include/stdlib.h:497,
from scripts/basic/fixdep.c:113:
/usr/include/alloca.h:33: error: expected ‘)’ before ‘__size’
In file included from scripts/basic/fixdep.c:113:
/usr/include/stdlib.h:502: error: expected ‘)’ before ‘__size’
/usr/include/stdlib.h:507: error: expected declaration specifiers or ‘...’ before ‘size_t’
/usr/include/stdlib.h:507: error: expected declaration specifiers or ‘...’ before ‘size_t’
/usr/include/stdlib.h:684: error: expected declaration specifiers or ‘...’ before ‘size_t’
/usr/include/stdlib.h:684: error: expected declaration specifiers or ‘...’ before ‘size_t’
/usr/include/stdlib.h:685: error: nonnull argument with out-of-range operand number (argument 1, operand 5)
/usr/include/stdlib.h:689: error: expected declaration specifiers or ‘...’ before ‘size_t’
/usr/include/stdlib.h:689: error: expected declaration specifiers or ‘...’ before ‘size_t’
/usr/include/stdlib.h:690: error: nonnull argument with out-of-range operand number (argument 1, operand 4)
/usr/include/stdlib.h:767: error: expected declaration specifiers or ‘...’ before ‘size_t’
/usr/include/stdlib.h:770: error: expected declaration specifiers or ‘...’ before ‘size_t’
/usr/include/stdlib.h:774: error: expected declaration specifiers or ‘...’ before ‘size_t’
/usr/include/stdlib.h:778: error: expected declaration specifiers or ‘...’ before ‘size_t’
/usr/include/stdlib.h:787: error: expected declaration specifiers or ‘...’ before ‘size_t’
/usr/include/stdlib.h:790: error: expected ‘)’ before ‘*’ token
/usr/include/stdlib.h:794: error: expected declaration specifiers or ‘...’ before ‘wchar_t’
/usr/include/stdlib.h:798: error: expected ‘=’, ‘,’, ‘;’, ‘asm’ or ‘__attribute__’ before ‘mbstowcs’
/usr/include/stdlib.h:801: error: expected ‘=’, ‘,’, ‘;’, ‘asm’ or ‘__attribute__’ before ‘wcstombs’
In file included from /usr/include/stdio.h:75,
from scripts/basic/fixdep.c:114:
/usr/include/libio.h:53:21: error: stdarg.h: Нет такого файла или каталога
In file included from /usr/include/stdio.h:75,
from scripts/basic/fixdep.c:114:
/usr/include/libio.h:332: error: expected specifier-qualifier-list before ‘size_t’
/usr/include/libio.h:364: error: expected declaration specifiers or ‘...’ before ‘size_t’
/usr/include/libio.h:373: error: expected declaration specifiers or ‘...’ before ‘size_t’
/usr/include/libio.h:489: error: expected declaration specifiers or ‘...’ before ‘__gnuc_va_list’
/usr/include/libio.h:491: error: expected declaration specifiers or ‘...’ before ‘__gnuc_va_list’
/usr/include/libio.h:493: error: expected ‘=’, ‘,’, ‘;’, ‘asm’ or ‘__attribute__’ before ‘_IO_sgetn’
In file included from scripts/basic/fixdep.c:114:
/usr/include/stdio.h:314: error: expected declaration specifiers or ‘...’ before ‘size_t’
/usr/include/stdio.h:321: error: expected declaration specifiers or ‘...’ before ‘size_t’
/usr/include/stdio.h:349: error: expected declaration specifiers or ‘...’ before ‘__gnuc_va_list’
/usr/include/stdio.h:354: error: expected declaration specifiers or ‘...’ before ‘__gnuc_va_list’
/usr/include/stdio.h:357: error: expected declaration specifiers or ‘...’ before ‘__gnuc_va_list’
/usr/include/stdio.h:363: error: expected declaration specifiers or ‘...’ before ‘size_t’
/usr/include/stdio.h:365: error: format string argument not a string type
/usr/include/stdio.h:367: error: expected declaration specifiers or ‘...’ before ‘size_t’
/usr/include/stdio.h:368: error: expected declaration specifiers or ‘...’ before ‘__gnuc_va_list’
/usr/include/stdio.h:369: error: format string argument not a string type
/usr/include/stdio.h:680: error: expected ‘=’, ‘,’, ‘;’, ‘asm’ or ‘__attribute__’ before ‘fread’
/usr/include/stdio.h:686: error: expected ‘=’, ‘,’, ‘;’, ‘asm’ or ‘__attribute__’ before ‘fwrite’
/usr/include/stdio.h:708: error: expected ‘=’, ‘,’, ‘;’, ‘asm’ or ‘__attribute__’ before ‘fread_unlocked’
/usr/include/stdio.h:710: error: expected ‘=’, ‘,’, ‘;’, ‘asm’ or ‘__attribute__’ before ‘fwrite_unlocked’
In file included from /usr/include/stdio.h:905,
from scripts/basic/fixdep.c:114:
/usr/include/bits/stdio.h:37: error: expected declaration specifiers or ‘...’ before ‘__gnuc_va_list’
/usr/include/bits/stdio.h: In function ‘vprintf’:
/usr/include/bits/stdio.h:39: error: ‘__arg’ undeclared (first use in this function)
/usr/include/bits/stdio.h:39: error: too many arguments to function ‘vfprintf’
In file included from scripts/basic/fixdep.c:115:
/usr/include/limits.h:125:26: error: no include path in which to search for limits.h
In file included from /usr/include/sys/uio.h:29,
from /usr/include/sys/socket.h:28,
from /usr/include/netinet/in.h:25,
from /usr/include/arpa/inet.h:23,
from scripts/basic/fixdep.c:117:
/usr/include/bits/uio.h: At top level:
/usr/include/bits/uio.h:47: error: expected specifier-qualifier-list before ‘size_t’
In file included from /usr/include/bits/socket.h:32,
from /usr/include/sys/socket.h:40,
from /usr/include/netinet/in.h:25,
from /usr/include/arpa/inet.h:23,
from scripts/basic/fixdep.c:117:
/usr/include/limits.h:125:26: error: no include path in which to search for limits.h
In file included from /usr/include/sys/socket.h:40,
from /usr/include/netinet/in.h:25,
from /usr/include/arpa/inet.h:23,
from scripts/basic/fixdep.c:117:
/usr/include/bits/socket.h:245: error: expected specifier-qualifier-list before ‘size_t’
/usr/include/bits/socket.h:259: error: expected specifier-qualifier-list before ‘size_t’
/usr/include/bits/socket.h: In function ‘__cmsg_nxthdr’:
/usr/include/bits/socket.h:296: error: ‘size_t’ undeclared (first use in this function)
/usr/include/bits/socket.h:296: error: expected ‘)’ before ‘__cmsg’
/usr/include/bits/socket.h:301: error: ‘struct cmsghdr’ has no member named ‘cmsg_len’
/usr/include/bits/socket.h:301: error: expected ‘)’ before ‘~’ token
/usr/include/bits/socket.h:302: error: ‘struct msghdr’ has no member named ‘msg_control’
/usr/include/bits/socket.h:303: error: ‘struct msghdr’ has no member named ‘msg_controllen’
/usr/include/bits/socket.h:304: error: ‘struct cmsghdr’ has no member named ‘cmsg_len’
/usr/include/bits/socket.h:304: error: expected ‘)’ before ‘~’ token
/usr/include/bits/socket.h:305: error: ‘struct msghdr’ has no member named ‘msg_control’
/usr/include/bits/socket.h:305: error: ‘struct msghdr’ has no member named ‘msg_controllen’
In file included from /usr/include/netinet/in.h:25,
from /usr/include/arpa/inet.h:23,
from scripts/basic/fixdep.c:117:
/usr/include/sys/socket.h: At top level:
/usr/include/sys/socket.h:141: error: expected declaration specifiers or ‘...’ before ‘size_t’
/usr/include/sys/socket.h:148: error: expected declaration specifiers or ‘...’ before ‘size_t’
/usr/include/sys/socket.h:155: error: expected declaration specifiers or ‘...’ before ‘size_t’
/usr/include/sys/socket.h:166: error: expected declaration specifiers or ‘...’ before ‘size_t’
In file included from scripts/basic/fixdep.c:117:
/usr/include/arpa/inet.h:78: error: expected declaration specifiers or ‘...’ before ‘size_t’
/usr/include/arpa/inet.h:84: error: expected declaration specifiers or ‘...’ before ‘size_t’
/usr/include/arpa/inet.h:90: error: expected declaration specifiers or ‘...’ before ‘size_t’
scripts/basic/fixdep.c: In function ‘grow_config’:
scripts/basic/fixdep.c:156: error: too many arguments to function ‘realloc’
scripts/basic/fixdep.c: In function ‘is_defined_config’:
scripts/basic/fixdep.c:174: error: too many arguments to function ‘memcmp’
scripts/basic/fixdep.c: In function ‘define_config’:
scripts/basic/fixdep.c:187: error: too many arguments to function ‘memcpy’
scripts/basic/fixdep.c: In function ‘use_config’:
scripts/basic/fixdep.c:214: error: too many arguments to function ‘memcpy’
scripts/basic/fixdep.c: At top level:
scripts/basic/fixdep.c:225: error: expected declaration specifiers or ‘...’ before ‘size_t’
scripts/basic/fixdep.c: In function ‘parse_config_file’:
scripts/basic/fixdep.c:227: error: ‘len’ undeclared (first use in this function)
scripts/basic/fixdep.c:241: error: too many arguments to function ‘memcmp’
scripts/basic/fixdep.c:250: error: too many arguments to function ‘memcmp’
scripts/basic/fixdep.c: In function ‘strrcmp’:
scripts/basic/fixdep.c:261: warning: implicit declaration of function ‘strlen’
scripts/basic/fixdep.c:261: warning: incompatible implicit declaration of built-in function ‘strlen’
scripts/basic/fixdep.c:267: error: too many arguments to function ‘memcmp’
scripts/basic/fixdep.c: In function ‘do_config_file’:
scripts/basic/fixdep.c:287: error: too many arguments to function ‘mmap’
scripts/basic/fixdep.c:294: error: too many arguments to function ‘parse_config_file’
scripts/basic/fixdep.c:296: error: too many arguments to function ‘munmap’
scripts/basic/fixdep.c: At top level:
scripts/basic/fixdep.c:301: error: expected declaration specifiers or ‘...’ before ‘size_t’
scripts/basic/fixdep.c: In function ‘parse_dep_file’:
scripts/basic/fixdep.c:304: error: ‘len’ undeclared (first use in this function)
scripts/basic/fixdep.c:313: error: too many arguments to function ‘memcpy’
scripts/basic/fixdep.c:328: error: too many arguments to function ‘memcpy’
scripts/basic/fixdep.c: In function ‘print_deps’:
scripts/basic/fixdep.c:359: error: too many arguments to function ‘mmap’
scripts/basic/fixdep.c:366: error: too many arguments to function ‘parse_dep_file’
scripts/basic/fixdep.c:368: error: too many arguments to function ‘munmap’
make[1]: *** [scripts/basic/fixdep] Ошибка 1
make: *** [scripts_basic] Ошибка 2