piranha gtv var tk tile-gtk-0 cmake build-unix32-make-re lease make Bu

 1
 2
 3
 4
 5
 6
 7
 8
 9
10
11
12
13
14
15
16
17
18
19
20
21
22
23
24
25
26
27
28
29
30
31
32
33
34
35
36
37
38
39
40
41
42
piranha@gtv ~/var/tk/tile-gtk-0.2/cmake/build-unix32-make-release>make
[ 5%] Building CXX object CMakeFiles/tilegtk0.2.dir/generic/tileGtk_Init.cpp.o
In file included from /home/piranha/var/tk/tile-gtk-0.2/generic/tileGtk_Elements.h:15,
from /home/piranha/var/tk/tile-gtk-0.2/generic/tileGtk_Utilities.h:17,
from /home/piranha/var/tk/tile-gtk-0.2/generic/tileGtk_Init.cpp:9:
/home/piranha/var/tk/tile-gtk-0.2/generic/tileGtk_TkHeaders.h:26:22: error: ttkTheme.h: No such file or directory
In file included from /home/piranha/var/tk/tile-gtk-0.2/generic/tileGtk_Utilities.h:17,
from /home/piranha/var/tk/tile-gtk-0.2/generic/tileGtk_Init.cpp:9:
/home/piranha/var/tk/tile-gtk-0.2/generic/tileGtk_Elements.h:18: error: ‘Ttk_Theme’ has not been declared
/home/piranha/var/tk/tile-gtk-0.2/generic/tileGtk_Elements.h:20: error: ‘Ttk_Theme’ has not been declared
/home/piranha/var/tk/tile-gtk-0.2/generic/tileGtk_Elements.h:22: error: ‘Ttk_Theme’ has not been declared
/home/piranha/var/tk/tile-gtk-0.2/generic/tileGtk_Elements.h:24: error: ‘Ttk_Theme’ has not been declared
/home/piranha/var/tk/tile-gtk-0.2/generic/tileGtk_Elements.h:26: error: ‘Ttk_Theme’ has not been declared
/home/piranha/var/tk/tile-gtk-0.2/generic/tileGtk_Elements.h:28: error: ‘Ttk_Theme’ has not been declared
/home/piranha/var/tk/tile-gtk-0.2/generic/tileGtk_Elements.h:30: error: ‘Ttk_Theme’ has not been declared
/home/piranha/var/tk/tile-gtk-0.2/generic/tileGtk_Elements.h:32: error: ‘Ttk_Theme’ has not been declared
/home/piranha/var/tk/tile-gtk-0.2/generic/tileGtk_Elements.h:34: error: ‘Ttk_Theme’ has not been declared
/home/piranha/var/tk/tile-gtk-0.2/generic/tileGtk_Elements.h:36: error: ‘Ttk_Theme’ has not been declared
/home/piranha/var/tk/tile-gtk-0.2/generic/tileGtk_Elements.h:38: error: ‘Ttk_Theme’ has not been declared
/home/piranha/var/tk/tile-gtk-0.2/generic/tileGtk_Elements.h:40: error: ‘Ttk_Theme’ has not been declared
/home/piranha/var/tk/tile-gtk-0.2/generic/tileGtk_Elements.h:42: error: ‘Ttk_Theme’ has not been declared
/home/piranha/var/tk/tile-gtk-0.2/generic/tileGtk_Elements.h:44: error: ‘Ttk_Theme’ has not been declared
/home/piranha/var/tk/tile-gtk-0.2/generic/tileGtk_Elements.h:46: error: ‘Ttk_Theme’ has not been declared
/home/piranha/var/tk/tile-gtk-0.2/generic/tileGtk_Elements.h:48: error: ‘Ttk_Theme’ has not been declared
/home/piranha/var/tk/tile-gtk-0.2/generic/tileGtk_Elements.h:50: error: ‘Ttk_Theme’ has not been declared
/home/piranha/var/tk/tile-gtk-0.2/generic/tileGtk_Elements.h:52: error: ‘Ttk_Theme’ has not been declared
In file included from /home/piranha/var/tk/tile-gtk-0.2/generic/tileGtk_Init.cpp:9:
/home/piranha/var/tk/tile-gtk-0.2/generic/tileGtk_Utilities.h:132: warning: ‘TileGtk_StateTableLookup’ initialized and declared ‘extern’
/home/piranha/var/tk/tile-gtk-0.2/generic/tileGtk_Utilities.h:132: error: ‘Ttk_StateTable’ was not declared in this scope
/home/piranha/var/tk/tile-gtk-0.2/generic/tileGtk_Utilities.h:132: error: expected primary-expression before ‘,’ token
/home/piranha/var/tk/tile-gtk-0.2/generic/tileGtk_Utilities.h:132: error: expected primary-expression before ‘unsigned’
/home/piranha/var/tk/tile-gtk-0.2/generic/tileGtk_Utilities.h:132: error: initializer expression list treated as compound expression
/home/piranha/var/tk/tile-gtk-0.2/generic/tileGtk_Utilities.h:168: error: ‘Ttk_Box’ has not been declared
/home/piranha/var/tk/tile-gtk-0.2/generic/tileGtk_Init.cpp: In function ‘int Tilegtk_Init(Tcl_Interp*)’:
/home/piranha/var/tk/tile-gtk-0.2/generic/tileGtk_Init.cpp:986: error: ‘Ttk_Theme’ was not declared in this scope
/home/piranha/var/tk/tile-gtk-0.2/generic/tileGtk_Init.cpp:986: error: expected `;' before ‘themePtr’
/home/piranha/var/tk/tile-gtk-0.2/generic/tileGtk_Init.cpp:997: error: ‘Ttk_InitStubs’ was not declared in this scope
/home/piranha/var/tk/tile-gtk-0.2/generic/tileGtk_Init.cpp:1003: error: ‘themePtr’ was not declared in this scope
/home/piranha/var/tk/tile-gtk-0.2/generic/tileGtk_Init.cpp:1003: error: ‘Ttk_CreateTheme’ was not declared in this scope
make[2]: *** [CMakeFiles/tilegtk0.2.dir/generic/tileGtk_Init.cpp.o] Error 1
make[1]: *** [CMakeFiles/tilegtk0.2.dir/all] Error 2
make: *** [all] Error 2