sudo emerge -uDNtva world

 1
 2
 3
 4
 5
 6
 7
 8
 9
10
11
12
13
14
15
16
17
18
19
20
i686-pc-linux-gnu-gcc -I.. -I../.. -I../../include -fPIC -DOPENSSL_PIC -DOPENSSL_THREADS -D_REENTRANT -DDSO_DLFCN -DHAVE_DLFCN_H -DL_ENDIAN -DTERMIO -Wall -DOPENSSL_BN_ASM_PART_WORDS -DSHA1_ASM -DMD5_ASM -DRMD160_ASM -DAES_ASM -mtune=pentium3 -pipe -fomit-frame-pointer -Wa,--noexecstack -c -o eng_cryptodev.o eng_cryptodev.c
i686-pc-linux-gnu-gcc -I.. -I../.. -I../../include -fPIC -DOPENSSL_PIC -DOPENSSL_THREADS -D_REENTRANT -DDSO_DLFCN -DHAVE_DLFCN_H -DL_ENDIAN -DTERMIO -Wall -DOPENSSL_BN_ASM_PART_WORDS -DSHA1_ASM -DMD5_ASM -DRMD160_ASM -DAES_ASM -mtune=pentium3 -pipe -fomit-frame-pointer -Wa,--noexecstack -c -o eng_padlock.o eng_padlock.c
eng_padlock.c: В функции ‘padlock_xcrypt_ecb’
eng_padlock.c:445: ошибка: can't find a register in class ‘GENERAL_REGS’ while reloading ‘asm’
make[2]: *** [eng_padlock.o] Ошибка 1
make[2]: Leaving directory `/var/tmp/portage/dev-libs/openssl-0.9.8e-r2/work/openssl-0.9.8e/crypto/engine'
make[1]: *** [subdirs] Ошибка 1
make[1]: Leaving directory `/var/tmp/portage/dev-libs/openssl-0.9.8e-r2/work/openssl-0.9.8e/crypto'
make: *** [build_crypto] Ошибка 1
!!! ERROR: dev-libs/openssl-0.9.8e-r2 failed.
Call stack:
ebuild.sh, line 1638: Called dyn_compile
ebuild.sh, line 985: Called qa_call 'src_compile'
ebuild.sh, line 44: Called src_compile
openssl-0.9.8e-r2.ebuild, line 112: Called die
!!! make all failed
!!! If you need support, post the topmost build error, and the call stack if relevant.
!!! A complete build log is located at '/var/tmp/portage/dev-libs/openssl-0.9.8e-r2/temp/build.log'.