home roman RPM BUILD plasma-applet-kuawei -1 kuawei cpp 26 38 error so

 1
 2
 3
 4
 5
 6
 7
 8
 9
10
11
12
13
14
15
16
17
18
19
20
21
22
23
24
25
26
27
28
29
30
31
32
33
34
35
/home/roman/RPM/BUILD/plasma-applet-kuawei-1.1/kuawei.cpp:26:38: error: solid/control/networking.h: No such file or directory
/home/roman/RPM/BUILD/plasma-applet-kuawei-1.1/kuawei.cpp:27:44: error: solid/control/networkinterface.h: No such file or directory
/home/roman/RPM/BUILD/plasma-applet-kuawei-1.1/kuawei.cpp:28:42: error: solid/control/networkmanager.h: No such file or directory
/home/roman/RPM/BUILD/plasma-applet-kuawei-1.1/kuawei.cpp:30:40: error: solid/control/powermanager.h: No such file or directory
/home/roman/RPM/BUILD/plasma-applet-kuawei-1.1/kuawei.cpp: In member function 'virtual void Kuawei::init()':
/home/roman/RPM/BUILD/plasma-applet-kuawei-1.1/kuawei.cpp:77: error: 'Solid::Control' has not been declared
/home/roman/RPM/BUILD/plasma-applet-kuawei-1.1/kuawei.cpp:80: error: 'Solid::Control' has not been declared
/home/roman/RPM/BUILD/plasma-applet-kuawei-1.1/kuawei.cpp:83: error: 'Solid::Control' has not been declared
/home/roman/RPM/BUILD/plasma-applet-kuawei-1.1/kuawei.cpp: At global scope:
/home/roman/RPM/BUILD/plasma-applet-kuawei-1.1/kuawei.cpp:89: warning: unused parameter 'button'
/home/roman/RPM/BUILD/plasma-applet-kuawei-1.1/kuawei.cpp: In member function 'void Kuawei::updateInterfaces()':
/home/roman/RPM/BUILD/plasma-applet-kuawei-1.1/kuawei.cpp:98: error: 'Solid::Control' has not been declared
/home/roman/RPM/BUILD/plasma-applet-kuawei-1.1/kuawei.cpp:98: error: expected `;' before 'm_interfaces'
/home/roman/RPM/BUILD/plasma-applet-kuawei-1.1/kuawei.cpp:100: error: 'm_interfaces' was not declared in this scope
/home/roman/RPM/BUILD/plasma-applet-kuawei-1.1/kuawei.cpp:100: error: template argument 1 is invalid
/home/roman/RPM/BUILD/plasma-applet-kuawei-1.1/kuawei.cpp:100: error: invalid type in declaration before '(' token
/home/roman/RPM/BUILD/plasma-applet-kuawei-1.1/kuawei.cpp:100: error: request for member 'brk' in '_container_', which is of non-class type 'int'
/home/roman/RPM/BUILD/plasma-applet-kuawei-1.1/kuawei.cpp:100: error: request for member 'i' in '_container_', which is of non-class type 'int'
/home/roman/RPM/BUILD/plasma-applet-kuawei-1.1/kuawei.cpp:100: error: request for member 'e' in '_container_', which is of non-class type 'int'
/home/roman/RPM/BUILD/plasma-applet-kuawei-1.1/kuawei.cpp:100: error: request for member 'brk' in '_container_', which is of non-class type 'int'
/home/roman/RPM/BUILD/plasma-applet-kuawei-1.1/kuawei.cpp:100: error: request for member 'i' in '_container_', which is of non-class type 'int'
/home/roman/RPM/BUILD/plasma-applet-kuawei-1.1/kuawei.cpp:100: error: 'Solid::Control' has not been declared
/home/roman/RPM/BUILD/plasma-applet-kuawei-1.1/kuawei.cpp:100: error: 'interface' was not declared in this scope
/home/roman/RPM/BUILD/plasma-applet-kuawei-1.1/kuawei.cpp:100: error: request for member 'i' in '_container_', which is of non-class type 'int'
/home/roman/RPM/BUILD/plasma-applet-kuawei-1.1/kuawei.cpp:100: error: request for member 'brk' in '_container_', which is of non-class type 'int'
/home/roman/RPM/BUILD/plasma-applet-kuawei-1.1/kuawei.cpp:101: error: 'Solid::Control' has not been declared
/home/roman/RPM/BUILD/plasma-applet-kuawei-1.1/kuawei.cpp:101: error: 'Solid::Control' has not been declared
make[2]: *** [CMakeFiles/plasma_applet_kuawei.dir/kuawei.o] Error 1
make[2]: *** Waiting for unfinished jobs....
make[2]: Leaving directory `/home/roman/RPM/BUILD/plasma-applet-kuawei-1.1/BUILD-i586-alt-linux'
make[1]: *** [CMakeFiles/plasma_applet_kuawei.dir/all] Error 2
make[1]: Leaving directory `/home/roman/RPM/BUILD/plasma-applet-kuawei-1.1/BUILD-i586-alt-linux'
make: *** [all] Error 2
make: Leaving directory `/home/roman/RPM/BUILD/plasma-applet-kuawei-1.1/BUILD-i586-alt-linux'
ошибка: Неверный код возврата из /home/roman/RPM/rpm-tmp.40980 (%build)