a2k a2k-home tmp gst gst-python-0 10 14 make Making all in common Maki

 1
 2
 3
 4
 5
 6
 7
 8
 9
10
11
12
13
14
15
16
17
18
19
20
21
22
23
24
25
26
27
28
29
30
31
32
33
34
35
36
a2k@a2k-home:~/tmp/gst/gst-python-0.10.14.4$ make
Making all in common
Making all in m4
Making all in codegen
Making all in gst
Making all in extend
CC gst-argtypes.o
CC gstmodule.o
CC pygstiterator.o
CC pygstminiobject.o
CC pygstvalue.o
CC pygstexception.o
Traceback (most recent call last):
File "../codegen/codegen.py", line 1572, in <module>
sys.exit(main(sys.argv))
File "../codegen/codegen.py", line 1529, in main
o = override.Overrides(arg, path=extendpath)
File "/home/a2k/tmp/gst/gst-python-0.10.14.4/codegen/override.py", line 49, in __init__
self.handle_file(filename)
File "/home/a2k/tmp/gst/gst-python-0.10.14.4/codegen/override.py", line 92, in handle_file
self.__parse_override(buf, startline, filename)
File "/home/a2k/tmp/gst/gst-python-0.10.14.4/codegen/override.py", line 174, in __parse_override
self.handle_file(filename)
File "/home/a2k/tmp/gst/gst-python-0.10.14.4/codegen/override.py", line 92, in handle_file
self.__parse_override(buf, startline, filename)
File "/home/a2k/tmp/gst/gst-python-0.10.14.4/codegen/override.py", line 174, in __parse_override
self.handle_file(filename)
File "/home/a2k/tmp/gst/gst-python-0.10.14.4/codegen/override.py", line 92, in handle_file
self.__parse_override(buf, startline, filename)
File "/home/a2k/tmp/gst/gst-python-0.10.14.4/codegen/override.py", line 104, in __parse_override
command = words[0]
IndexError: list index out of range
make[3]: *** [gst.c] Error 1
make[2]: *** [all-recursive] Error 1
make[1]: *** [all-recursive] Error 1
make: *** [all] Error 2