-c -O2 -frtti -fexceptions -mthreads -Wall -DUNICODE -DQT_LARGEFILE_SU

 1
 2
 3
 4
 5
 6
 7
 8
 9
10
11
12
g++ -c -O2 -frtti -fexceptions -mthreads -Wall -DUNICODE -DQT_LARGEFILE_SUPPORT -DUNIX_TRANSLATIONS_DIR=\"/usr/share/imageshack-uploader/translations\" -DVERSION=\"2.1.0\" -DDEVELOPER_KEY=\"BXT1Z35V8f6ee0522939d8d7852dbe67b1eb9595\" -DQT_DLL -DQT_NO_DEBUG -DQT_XML_LIB -DQT_GUI_LIB -DQT_NETWORK_LIB -DQT_CORE_LIB -DQT_THREAD_SUPPORT -DQT_NEEDS_QMAIN -I"..\Qt\2009.03\qt\include\QtCore" -I"..\Qt\2009.03\qt\include\QtNetwork" -I"..\Qt\2009.03\qt\include\QtGui" -I"..\Qt\2009.03\qt\include\QtXml" -I"..\Qt\2009.03\qt\include" -I"qtsingleapplication" -I"qtsingleapplication" -I"..\Qt\2009.03\qt\include\ActiveQt" -I"release" -I"." -I"..\Qt\2009.03\qt\mkspecs\win32-g++" -o release\main.o main.cpp
In file included from fileuploader.h:34,
from mainwindow.h:37,
from main.cpp:33:
httprequest.h:24: error: expected `,' or `...' before '>' token
httprequest.h:24: error: wrong number of template arguments (1, should be 2)
../Qt/2009.03/qt/include/QtCore/../../src/corelib/tools/qpair.h:55: error: provided for `template<class T1, class T2> struct QPair'
httprequest.h:24: error: template argument 1 is invalid
mingw32-make[1]: Leaving directory `C:/imageshack'
mingw32-make: Leaving directory `C:/imageshack'
mingw32-make[1]: *** [release/main.o] Error 1
mingw32-make: *** [release] Error 2