i686-pc-linux-gnu-gc -DHAVE_CONFIG_H -I -I -I lib -march prescott -O2

 1
 2
 3
 4
 5
 6
 7
 8
 9
10
11
12
13
14
15
16
17
18
19
20
21
22
23
24
25
26
27
28
29
30
31
32
33
34
35
36
37
38
39
40
41
42
43
44
45
46
47
48
49
50
51
52
53
54
55
56
57
58
59
60
61
62
63
64
65
66
67
68
69
70
i686-pc-linux-gnu-gcc -DHAVE_CONFIG_H -I. -I.. -I../lib -march=prescott -O2 -pipe -fomit-frame-pointer -MT pam_pass.o -MD -MP -MF .deps/pam_pass.Tpo -c -o pam_pass.o pam_pass.c
In file included from pam_pass.c:50:
../lib/pam_defs.h:42: ошибка: ‘SHADOW_PAM_CONVERSATION’ не описан в этой области (не в функции)
In file included from pam_pass.c:50:
../lib/pam_defs.h:48:1: warning: "PAM_ESTABLISH_CRED" redefined
In file included from /usr/include/security/pam_appl.h:18,
from ../lib/pam_defs.h:32,
from pam_pass.c:50:
/usr/include/security/_pam_types.h:108:1: warning: this is the location of the previous definition
In file included from pam_pass.c:50:
../lib/pam_defs.h:51:1: warning: "PAM_DELETE_CRED" redefined
In file included from /usr/include/security/pam_appl.h:18,
from ../lib/pam_defs.h:32,
from pam_pass.c:50:
/usr/include/security/_pam_types.h:111:1: warning: this is the location of the previous definition
In file included from pam_pass.c:50:
../lib/pam_defs.h:54:1: warning: "PAM_NEW_AUTHTOK_REQD" redefined
In file included from /usr/include/security/pam_appl.h:18,
from ../lib/pam_defs.h:32,
from pam_pass.c:50:
/usr/include/security/_pam_types.h:49:1: warning: this is the location of the previous definition
In file included from pam_pass.c:50:
../lib/pam_defs.h:57:1: warning: "PAM_DATA_SILENT" redefined
In file included from /usr/include/security/pam_appl.h:18,
from ../lib/pam_defs.h:32,
from pam_pass.c:50:
/usr/include/security/_pam_types.h:199:1: warning: this is the location of the previous definition
make[2]: *** [pam_pass.o] Ошибка 1
make[2]: *** Ожидание завершения заданий...
mv -f .deps/getdate.Tpo .deps/getdate.Po
mv -f .deps/loginprompt.Tpo .deps/loginprompt.Po
make[2]: Leaving directory `/var/tmp/portage/sys-apps/shadow-4.1.2.2/work/shadow-4.1.2.2/libmisc'
make[1]: *** [all-recursive] Ошибка 1
make[1]: Leaving directory `/var/tmp/portage/sys-apps/shadow-4.1.2.2/work/shadow-4.1.2.2'
make: *** [all] Ошибка 2
*
* ERROR: sys-apps/shadow-4.1.2.2 failed.
* Call stack:
* ebuild.sh, line 49: Called src_compile
* environment, line 2672: Called die
* The specific snippet of code:
* emake || die "compile problem"
* The die message:
* compile problem
*
* If you need support, post the topmost build error, and the call stack if relevant.
* A complete build log is located at '/var/tmp/portage/sys-apps/shadow-4.1.2.2/temp/build.log'.
* The ebuild environment file is located at '/var/tmp/portage/sys-apps/shadow-4.1.2.2/temp/environment'.
*
>>> Failed to emerge sys-apps/shadow-4.1.2.2, Log file:
>>> '/var/tmp/portage/sys-apps/shadow-4.1.2.2/temp/build.log'
* Messages for package sys-apps/shadow-4.1.2.2:
*
* ERROR: sys-apps/shadow-4.1.2.2 failed.
* Call stack:
* ebuild.sh, line 49: Called src_compile
* environment, line 2672: Called die
* The specific snippet of code:
* emake || die "compile problem"
* The die message:
* compile problem
*
* If you need support, post the topmost build error, and the call stack if relevant.
* A complete build log is located at '/var/tmp/portage/sys-apps/shadow-4.1.2.2/temp/build.log'.
* The ebuild environment file is located at '/var/tmp/portage/sys-apps/shadow-4.1.2.2/temp/environment'.
*