compileJava UP-TO-DATE processResources UP-TO-DATE classes UP-TO-DATE

 1
 2
 3
 4
 5
 6
 7
 8
 9
10
11
12
13
14
15
16
17
18
19
20
21
22
23
24
25
26
27
28
29
30
31
32
33
34
35
36
37
38
39
40
41
42
43
44
45
46
47
48
49
50
51
52
53
54
55
56
:compileJava UP-TO-DATE
:processResources UP-TO-DATE
:classes UP-TO-DATE
:jar
:bootRepackage
:assemble
:compileTestJava UP-TO-DATE
:processTestResources UP-TO-DATE
:testClasses UP-TO-DATE
:test
ru.vniins.ais.realty.shared.repository.ByIdSpecificationTest > shouldFilterWithIds FAILED
java.lang.IllegalStateException
Caused by: org.springframework.beans.factory.BeanCreationException
Caused by: java.lang.IllegalArgumentException
ru.vniins.ais.realty.shared.repository.ByIdSpecificationTest > shouldWorkWithNoIds FAILED
java.lang.IllegalStateException
Caused by: org.springframework.beans.factory.BeanCreationException
Caused by: java.lang.IllegalArgumentException
ru.vniins.ais.realty.shared.repository.ByMilitaryUnitSpecificationTest > shouldWorkWithOtherEntity FAILED
java.lang.IllegalStateException
Caused by: org.springframework.beans.factory.BeanCreationException
Caused by: java.lang.IllegalArgumentException
ru.vniins.ais.realty.shared.repository.ByMilitaryUnitSpecificationTest > shouldFilterThingsByMilitaryUnits FAILED
java.lang.IllegalStateException
Caused by: org.springframework.beans.factory.BeanCreationException
Caused by: java.lang.IllegalArgumentException
ru.vniins.ais.realty.shared.repository.ByMilitaryUnitSpecificationTest > shouldFilterMilitaryUnits FAILED
java.lang.IllegalStateException
Caused by: org.springframework.beans.factory.BeanCreationException
Caused by: java.lang.IllegalArgumentException
ru.vniins.ais.realty.shared.repository.ByMilitaryUnitSpecificationTest > shouldWorkWithNoMilitaryUnit FAILED
java.lang.IllegalStateException
Caused by: org.springframework.beans.factory.BeanCreationException
Caused by: java.lang.IllegalArgumentException
53 tests completed, 6 failed
:test FAILED
FAILURE: Build failed with an exception.
* What went wrong:
Execution failed for task ':test'.
> There were failing tests. See the report at: file:///B:/webroot/realty-backend/build/reports/tests/index.html
* Try:
Run with --stacktrace option to get the stack trace. Run with --info or --debug option to get more log output.
BUILD FAILED
Total time: 21.0 secs