autogen sh Running aclocal usr share aclocal sigc m4 warning underquot

  1
  2
  3
  4
  5
  6
  7
  8
  9
 10
 11
 12
 13
 14
 15
 16
 17
 18
 19
 20
 21
 22
 23
 24
 25
 26
 27
 28
 29
 30
 31
 32
 33
 34
 35
 36
 37
 38
 39
 40
 41
 42
 43
 44
 45
 46
 47
 48
 49
 50
 51
 52
 53
 54
 55
 56
 57
 58
 59
 60
 61
 62
 63
 64
 65
 66
 67
 68
 69
 70
 71
 72
 73
 74
 75
 76
 77
 78
 79
 80
 81
 82
 83
 84
 85
 86
 87
 88
 89
 90
 91
 92
 93
 94
 95
 96
 97
 98
 99
100
101
102
103
104
105
106
107
108
109
110
111
112
113
114
115
116
117
118
119
120
121
122
123
124
125
126
127
128
129
130
131
132
133
134
135
136
137
138
139
140
141
142
143
144
145
146
147
$ ./autogen.sh
Running aclocal...
/usr/share/aclocal/sigc++.m4:8: warning: underquoted definition of AM_PATH_SIGC
run info '(automake)Extending aclocal'
or see http://sources.redhat.com/automake/automake.html#Extending-aclocal
/usr/share/aclocal/libicq2000.m4:15: warning: underquoted definition of AM_PATH_LIBICQ2000
/usr/share/aclocal/libIDL.m4:6: warning: underquoted definition of AM_PATH_LIBIDL
/usr/share/aclocal/ORBit.m4:4: warning: underquoted definition of AM_PATH_ORBIT
Running autoconf...
Running libtoolize...
Running automake...
checking for a BSD-compatible install... /bin/install -c
checking whether build environment is sane... yes
checking for gawk... gawk
checking whether make sets $(MAKE)... yes
checking for gcc... gcc
checking for C compiler default output file name... a.out
checking whether the C compiler works... yes
checking whether we are cross compiling... no
checking for suffix of executables...
checking for suffix of object files... o
checking whether we are using the GNU C compiler... yes
checking whether gcc accepts -g... yes
checking for gcc option to accept ISO C89... none needed
checking for style of include used by make... GNU
checking dependency style of gcc... gcc3
checking for pkg-config... /usr/bin/pkg-config
checking pkg-config is at least version 0.9.0... yes
checking for ECORE... yes
checking for ECORE_FILE... yes
checking for ECORE_EVAS... yes
checking for EVAS... yes
checking for EDJE... yes
checking for ECHOICEBOX... yes
configure: creating ./config.status
config.status: creating Makefile
config.status: creating src/Makefile
config.status: creating config.h
config.status: executing depfiles commands
[alex@hosaka gm]$ ./configure
checking for a BSD-compatible install... /bin/install -c
checking whether build environment is sane... yes
checking for gawk... gawk
checking whether make sets $(MAKE)... yes
checking for gcc... gcc
checking for C compiler default output file name... a.out
checking whether the C compiler works... yes
checking whether we are cross compiling... no
checking for suffix of executables...
checking for suffix of object files... o
checking whether we are using the GNU C compiler... yes
checking whether gcc accepts -g... yes
checking for gcc option to accept ISO C89... none needed
checking for style of include used by make... GNU
checking dependency style of gcc... gcc3
checking for pkg-config... /usr/bin/pkg-config
checking pkg-config is at least version 0.9.0... yes
checking for ECORE... yes
checking for ECORE_FILE... yes
checking for ECORE_EVAS... yes
checking for EVAS... yes
checking for EDJE... yes
checking for ECHOICEBOX... yes
configure: creating ./config.status
config.status: creating Makefile
config.status: creating src/Makefile
config.status: creating config.h
config.status: config.h is unchanged
config.status: executing depfiles commands
[alex@hosaka gm]$ make
cd . && /bin/sh /home/alex/devel/gm/missing --run autoheader
rm -f stamp-h1
touch config.h.in
cd . && /bin/sh ./config.status config.h
config.status: creating config.h
config.status: config.h is unchanged
make all-recursive
make[1]: Entering directory `/home/alex/devel/gm'
Making all in src
make[2]: Entering directory `/home/alex/devel/gm/src'
if gcc -DHAVE_CONFIG_H -I. -I. -I.. -I/usr/local/include -I/usr/local/include/eina-0 -I/usr/local/include/eina-0/eina -I/usr/l ocal/include -I/usr/local/include/eina-0 -I/usr/local/include/eina-0/eina -DHAVE_ECORE_X_XCB -I/usr/local/include -I/usr/local /include/eina-0 -I/usr/local/include/eina-0/eina -I/usr/local/include -I/usr/local/include/eina-0 -I/usr/local/include/eina-0/ eina -I/usr/local/include -Wall -g -O2 -MT gm.o -MD -MP -MF ".deps/gm.Tpo" -c -o gm.o gm.c; \
then mv -f ".deps/gm.Tpo" ".deps/gm.Po"; else rm -f ".deps/gm.Tpo"; exit 1; fi
gm.c: In function 'run':
gm.c:125: warning: passing argument 6 of 'choicebox_new' from incompatible pointer type
gcc -Wall -g -O2 -o gm -L/usr/local/lib -levas -leina -L/usr/local/lib -lecore -leina -L/usr/local/lib -lecore_evas -lecore -levas -lecore_x -leina -L/usr/local/lib -ledje -lembryo -lecore_job -levas -leet -lecore -lssl -lcrypto -ldl -leina -L/usr/local/lib -lechoicebox gm.o
gm.o: In function `main':
/home/alex/devel/gm/src/gm.c:147: undefined reference to `evas_init'
/home/alex/devel/gm/src/gm.c:149: undefined reference to `ecore_init'
/home/alex/devel/gm/src/gm.c:151: undefined reference to `ecore_evas_init'
/home/alex/devel/gm/src/gm.c:153: undefined reference to `edje_init'
gm.o: In function `run':
/home/alex/devel/gm/src/gm.c:107: undefined reference to `ecore_event_handler_add'
/home/alex/devel/gm/src/gm.c:109: undefined reference to `ecore_evas_software_x11_new'
/home/alex/devel/gm/src/gm.c:110: undefined reference to `ecore_evas_title_set'
/home/alex/devel/gm/src/gm.c:111: undefined reference to `ecore_evas_name_class_set'
/home/alex/devel/gm/src/gm.c:113: undefined reference to `ecore_evas_get'
/home/alex/devel/gm/src/gm.c:115: undefined reference to `ecore_evas_callback_delete_request_set'
/home/alex/devel/gm/src/gm.c:117: undefined reference to `edje_object_add'
/home/alex/devel/gm/src/gm.c:118: undefined reference to `evas_object_name_set'
/home/alex/devel/gm/src/gm.c:119: undefined reference to `edje_object_file_set'
/home/alex/devel/gm/src/gm.c:120: undefined reference to `edje_object_signal_callback_add'
/home/alex/devel/gm/src/gm.c:121: undefined reference to `evas_object_show'
/home/alex/devel/gm/src/gm.c:125: undefined reference to `choicebox_new'
/home/alex/devel/gm/src/gm.c:126: undefined reference to `choicebox_set_size'
/home/alex/devel/gm/src/gm.c:127: undefined reference to `evas_object_name_set'
/home/alex/devel/gm/src/gm.c:128: undefined reference to `evas_object_resize'
/home/alex/devel/gm/src/gm.c:129: undefined reference to `evas_object_move'
/home/alex/devel/gm/src/gm.c:130: undefined reference to `evas_object_show'
/home/alex/devel/gm/src/gm.c:132: undefined reference to `evas_object_focus_set'
/home/alex/devel/gm/src/gm.c:133: undefined reference to `evas_object_event_callback_add'
/home/alex/devel/gm/src/gm.c:138: undefined reference to `ecore_evas_callback_resize_set'
/home/alex/devel/gm/src/gm.c:140: undefined reference to `ecore_evas_show'
/home/alex/devel/gm/src/gm.c:142: undefined reference to `ecore_main_loop_begin'
gm.o: In function `main':
/home/alex/devel/gm/src/gm.c:158: undefined reference to `edje_shutdown'
/home/alex/devel/gm/src/gm.c:159: undefined reference to `ecore_evas_shutdown'
/home/alex/devel/gm/src/gm.c:160: undefined reference to `ecore_shutdown'
/home/alex/devel/gm/src/gm.c:161: undefined reference to `evas_shutdown'
gm.o: In function `main_win_resize_handler':
/home/alex/devel/gm/src/gm.c:71: undefined reference to `ecore_evas_get'
/home/alex/devel/gm/src/gm.c:73: undefined reference to `evas_output_size_get'
/home/alex/devel/gm/src/gm.c:75: undefined reference to `evas_object_name_find'
/home/alex/devel/gm/src/gm.c:76: undefined reference to `evas_object_resize'
/home/alex/devel/gm/src/gm.c:78: undefined reference to `evas_object_name_find'
/home/alex/devel/gm/src/gm.c:79: undefined reference to `evas_object_resize'
/home/alex/devel/gm/src/gm.c:80: undefined reference to `evas_object_move'
gm.o: In function `main_win_key_handler':
/home/alex/devel/gm/src/gm.c:93: undefined reference to `evas_object_name_find'
/home/alex/devel/gm/src/gm.c:96: undefined reference to `choicebox_prev'
/home/alex/devel/gm/src/gm.c:100: undefined reference to `choicebox_prevpage'
/home/alex/devel/gm/src/gm.c:98: undefined reference to `choicebox_next'
gm.o: In function `footer_draw_handler':
/home/alex/devel/gm/src/gm.c:55: undefined reference to `edje_object_part_text_set'
gm.o: In function `draw_handler':
/home/alex/devel/gm/src/gm.c:40: undefined reference to `edje_object_part_text_set'
gm.o: In function `exit_handler':
/home/alex/devel/gm/src/gm.c:23: undefined reference to `ecore_main_loop_quit'
gm.o: In function `main_win_key_handler':
/home/alex/devel/gm/src/gm.c:102: undefined reference to `choicebox_nextpage'
gm.o: In function `main_win_close_handler':
/home/alex/devel/gm/src/gm.c:29: undefined reference to `ecore_main_loop_quit'
collect2: ld returned 1 exit status
make[2]: *** [gm] Ошибка 1
make[2]: Leaving directory `/home/alex/devel/gm/src'
make[1]: *** [all-recursive] Ошибка 1
make[1]: Leaving directory `/home/alex/devel/gm'
make: *** [all] Ошибка 2