make binaries system FileConverter_dbg не требует обновления In file i

 1
 2
 3
 4
 5
 6
 7
 8
 9
10
11
12
13
14
15
16
17
18
19
20
make[1]: `../../../binaries/system/FileConverter_dbg' не требует обновления.
In file included from ../../../libraries/cxxtest/include/cxxtest/StdValueTraits.h:10,
from ../../../source/lib/self_test.h:189,
from ../../../source/pch/test/precompiled.h:24,
from ../../../source/pch/test/precompiled.cpp:25:
../../../libraries/cxxtest/include/cxxtest/ValueTraits.h:281: error: redefinition of ‘class CxxTest::ValueTraits<long unsigned int>’
../../../libraries/cxxtest/include/cxxtest/ValueTraits.h:266: error: previous definition of ‘class CxxTest::ValueTraits<long unsigned int>’
make[1]: *** [obj/test_Debug/precompiled.h.gch] Ошибка 1
make: *** [test] Ошибка 2
make: *** Ожидание завершения заданий...
../../../binaries/system/liblowlevel_dbg.a(amd64.o): In function `cpu_CAS(unsigned long volatile*, unsigned long, unsigned long)':
/home/vovan/src/0-ad/build/workspaces/gcc/../../../source/lib/sysdep/arch/amd64/amd64.cpp:63: undefined reference to `amd64_CAS'
../../../binaries/system/liblowlevel_dbg.a(amd64.o): In function `cpu_AtomicAdd(long volatile*, long)':
/home/vovan/src/0-ad/build/workspaces/gcc/../../../source/lib/sysdep/arch/amd64/amd64.cpp:58: undefined reference to `amd64_AtomicAdd'
../../../binaries/system/liblowlevel_dbg.a(x86_x64.o): In function `cpuid_impl':
/home/vovan/src/0-ad/build/workspaces/gcc/../../../source/lib/sysdep/arch/x86_x64/x86_x64.cpp:58: undefined reference to `amd64_asm_cpuid'
collect2: ld returned 1 exit status
make[1]: *** [../../../binaries/system/pyrogenesis_dbg] Ошибка 1
make: *** [pyrogenesis] Ошибка 2
zsh: exit 2 make -j3