dened CC tmp Kernels AstraLinuxSE 15 3-1-hardened_4 15 3-1 astra13 bui

 1
 2
 3
 4
 5
 6
 7
 8
 9
10
11
12
13
14
15
16
17
dened'
CC [M] /tmp/Kernels/AstraLinuxSE/4.15.3-1-hardened_4.15.3-1.astra13/build/utils/md5/md5.o
scripts/Makefile.build:332: recipe for target '/tmp/Kernels/AstraLinuxSE/4.15.3-1-hardened_4.15.3-1.astra13/build/utils/md5/md5.o' failed
Makefile:1552: recipe for target '_module_/tmp/Kernels/AstraLinuxSE/4.15.3-1-hardened_4.15.3-1.astra13/build' failed
make[1]: Leaving directory '/tmp/Kernels/AstraLinuxSE/4.15.3-1-hardened_4.15.3-1.astra13/usr/src/linux-headers-4.15.3-1-hardened'
Makefile:125: recipe for target 'all' failed
make: Leaving directory '/home/keyliaran/Garda/es/lin_monitor/src/lkm'
cc1: error: cannot load plugin ./scripts/gcc-plugins/stackleak_plugin.so
./scripts/gcc-plugins/stackleak_plugin.so: undefined symbol: _ZN8opt_pass14set_pass_paramEjb
cc1: error: cannot load plugin ./scripts/gcc-plugins/structleak_plugin.so
./scripts/gcc-plugins/structleak_plugin.so: undefined symbol: _ZN8opt_pass14set_pass_paramEjb
cc1: error: cannot load plugin ./scripts/gcc-plugins/latent_entropy_plugin.so
./scripts/gcc-plugins/latent_entropy_plugin.so: undefined symbol: _ZN8opt_pass14set_pass_paramEjb
make[2]: *** [/tmp/Kernels/AstraLinuxSE/4.15.3-1-hardened_4.15.3-1.astra13/build/utils/md5/md5.o] Error 1
make[1]: *** [_module_/tmp/Kernels/AstraLinuxSE/4.15.3-1-hardened_4.15.3-1.astra13/build] Error 2
make: *** [all] Error 2
: exit status 2