Add config Add ldif Making servers slapd overlays statover Please run

 1
 2
 3
 4
 5
 6
 7
 8
 9
10
11
12
13
14
15
16
17
18
19
20
21
22
23
24
25
26
27
28
29
30
31
32
33
34
35
36
37
38
39
40
41
42
43
44
45
46
47
48
49
50
51
52
53
54
55
56
57
58
59
60
61
62
63
64
65
66
67
68
69
70
71
72
73
74
75
76
77
78
79
80
81
82
83
84
85
86
87
88
89
90
91
92
93
94
95
96
97
Add config ...
Add ldif ...
Making servers/slapd/overlays/statover.c
Please run "make depend" to build dependencies
make[7]: Entering directory `/usr/src/freeswitch/freeswitch-1.0.4-pre9/libs/openldap-2.4.11'
Making all in /usr/src/freeswitch/freeswitch-1.0.4-pre9/libs/openldap-2.4.11
Entering subdirectory include
make[8]: Entering directory `/usr/src/freeswitch/freeswitch-1.0.4-pre9/libs/openldap-2.4.11/include'
Making ldap_config.h
make[8]: Leaving directory `/usr/src/freeswitch/freeswitch-1.0.4-pre9/libs/openldap-2.4.11/include'
Entering subdirectory libraries
make[8]: Entering directory `/usr/src/freeswitch/freeswitch-1.0.4-pre9/libs/openldap-2.4.11/libraries'
Making all in /usr/src/freeswitch/freeswitch-1.0.4-pre9/libs/openldap-2.4.11/libraries
Entering subdirectory liblutil
make[9]: Entering directory `/usr/src/freeswitch/freeswitch-1.0.4-pre9/libs/openldap-2.4.11/libraries/liblutil'
In file included from ../../include/ac/socket.h:52,
from base64.c:46:
/usr/include/arpa/nameser.h:113: error: expected ‘:’, ‘,’, ‘;’, ‘}’ or ‘__attribute__’ before ‘*’ token
/usr/include/arpa/nameser.h:145: error: expected ‘:’, ‘,’, ‘;’, ‘}’ or ‘__attribute__’ before ‘*’ token
/usr/include/arpa/nameser.h:507: error: expected ‘=’, ‘,’, ‘;’, ‘asm’ or ‘__attribute__’ before ‘__ns_get16’
/usr/include/arpa/nameser.h:508: error: expected ‘=’, ‘,’, ‘;’, ‘asm’ or ‘__attribute__’ before ‘__ns_get32’
/usr/include/arpa/nameser.h:509: error: expected ‘)’ before ‘*’ token
/usr/include/arpa/nameser.h:510: error: expected ‘)’ before ‘*’ token
/usr/include/arpa/nameser.h:511: error: expected ‘;’, ‘,’ or ‘)’ before ‘*’ token
/usr/include/arpa/nameser.h:512: error: expected ‘;’, ‘,’ or ‘)’ before ‘*’ token
/usr/include/arpa/nameser.h:518: error: expected ‘;’, ‘,’ or ‘)’ before ‘*’ token
/usr/include/arpa/nameser.h:522: error: expected ‘)’ before ‘char’
/usr/include/arpa/nameser.h:523: error: expected declaration specifiers or ‘...’ before ‘u_long’
/usr/include/arpa/nameser.h:525: error: expected ‘;’, ‘,’ or ‘)’ before ‘*’ token
/usr/include/arpa/nameser.h:526: error: expected ‘;’, ‘,’ or ‘)’ before ‘*’ token
/usr/include/arpa/nameser.h:527: error: expected declaration specifiers or ‘...’ before ‘u_char’
/usr/include/arpa/nameser.h:528: error: expected ‘;’, ‘,’ or ‘)’ before ‘*’ token
/usr/include/arpa/nameser.h:530: error: expected ‘;’, ‘,’ or ‘)’ before ‘*’ token
/usr/include/arpa/nameser.h:532: error: expected ‘;’, ‘,’ or ‘)’ before ‘*’ token
/usr/include/arpa/nameser.h:534: error: expected declaration specifiers or ‘...’ before ‘u_char’
/usr/include/arpa/nameser.h:535: error: expected ‘;’, ‘,’ or ‘)’ before ‘*’ token
/usr/include/arpa/nameser.h:536: error: expected ‘;’, ‘,’ or ‘)’ before ‘*’ token
/usr/include/arpa/nameser.h:537: error: expected ‘;’, ‘,’ or ‘)’ before ‘*’ token
/usr/include/arpa/nameser.h:539: error: expected ‘)’ before ‘*’ token
/usr/include/arpa/nameser.h:541: error: expected ‘)’ before ‘*’ token
/usr/include/arpa/nameser.h:543: error: expected ‘;’, ‘,’ or ‘)’ before ‘*’ token
/usr/include/arpa/nameser.h:545: error: expected ‘=’, ‘,’, ‘;’, ‘asm’ or ‘__attribute__’ before ‘*’ token
/usr/include/arpa/nameser.h:546: error: expected ‘)’ before ‘*’ token
/usr/include/arpa/nameser.h:548: error: expected ‘)’ before ‘*’ token
/usr/include/arpa/nameser.h:550: error: expected ‘;’, ‘,’ or ‘)’ before ‘*’ token
In file included from /usr/include/arpa/nameser.h:559,
from ../../include/ac/socket.h:52,
from base64.c:46:
/usr/include/arpa/nameser_compat.h:66: error: duplicate member ‘rd’
/usr/include/arpa/nameser_compat.h:67: error: duplicate member ‘tc’
/usr/include/arpa/nameser_compat.h:68: error: duplicate member ‘aa’
/usr/include/arpa/nameser_compat.h:69: error: duplicate member ‘opcode’
/usr/include/arpa/nameser_compat.h:70: error: duplicate member ‘qr’
/usr/include/arpa/nameser_compat.h:72: error: duplicate member ‘rcode’
/usr/include/arpa/nameser_compat.h:73: error: duplicate member ‘cd’
/usr/include/arpa/nameser_compat.h:74: error: duplicate member ‘ad’
/usr/include/arpa/nameser_compat.h:75: error: duplicate member ‘unused’
/usr/include/arpa/nameser_compat.h:76: error: duplicate member ‘ra’
base64.c:119: error: expected ‘)’ before ‘const’
base64.c:191: error: expected declaration specifiers or ‘...’ before ‘u_char’
base64.c:189: error: conflicting types for ‘lutil_b64_pton’
../../include/lutil.h:45: error: previous declaration of ‘lutil_b64_pton’ was here
base64.c: In function ‘lutil_b64_pton’:
base64.c:201: warning: implicit declaration of function ‘isascii’
base64.c:213: error: ‘target’ undeclared (first use in this function)
base64.c:213: error: (Each undeclared identifier is reported only once
base64.c:213: error: for each function it appears in.)
make[9]: *** [base64.o] Ошибка 1
make[9]: Leaving directory `/usr/src/freeswitch/freeswitch-1.0.4-pre9/libs/openldap-2.4.11/libraries/liblutil'
make[8]: *** [all-common] Ошибка 1
make[8]: Leaving directory `/usr/src/freeswitch/freeswitch-1.0.4-pre9/libs/openldap-2.4.11/libraries'
make[7]: *** [all-common] Ошибка 1
make[7]: Leaving directory `/usr/src/freeswitch/freeswitch-1.0.4-pre9/libs/openldap-2.4.11'
make[6]: *** [/usr/src/freeswitch/freeswitch-1.0.4-pre9/libs/openldap-2.4.11/libraries/libldap_r/libldap_r.la] Ошибка 2
make[6]: Leaving directory `/usr/src/freeswitch/freeswitch-1.0.4-pre9/src/mod/directories/mod_ldap'
make[5]: *** [all] Ошибка 1
make[5]: Leaving directory `/usr/src/freeswitch/freeswitch-1.0.4-pre9/src/mod/directories/mod_ldap'
make[4]: *** [directories/mod_ldap-all] Ошибка 1
make[4]: Leaving directory `/usr/src/freeswitch/freeswitch-1.0.4-pre9/src/mod'
make[3]: *** [all-recursive] Ошибка 1
make[3]: Leaving directory `/usr/src/freeswitch/freeswitch-1.0.4-pre9/src'
Making all in build
make[3]: Entering directory `/usr/src/freeswitch/freeswitch-1.0.4-pre9/build'
+-------- FreeSWITCH Build Complete -----------+
+ FreeSWITCH has been successfully built. +
+ Install by running: +
+ +
+ /usr/bin/make install +
+----------------------------------------------+
make[3]: Leaving directory `/usr/src/freeswitch/freeswitch-1.0.4-pre9/build'
make[2]: *** [all-recursive] Ошибка 1
make[2]: Leaving directory `/usr/src/freeswitch/freeswitch-1.0.4-pre9'
make[1]: *** [all] Ошибка 2
make[1]: Leaving directory `/usr/src/freeswitch/freeswitch-1.0.4-pre9'
make: *** [build-stamp] Ошибка 2
dpkg-buildpackage: сбой: debian/rules build возвратил код ошибки 2