anon anon-laptop src 0-ad build workspaces gcc lsb_release -a No LSB m

 1
 2
 3
 4
 5
 6
 7
 8
 9
10
11
12
13
14
15
16
17
18
19
20
21
22
23
24
25
26
27
28
29
30
31
32
33
34
35
36
37
38
39
40
41
42
43
44
45
46
47
48
49
50
51
52
53
54
55
56
57
anon@anon-laptop:~/src/0-ad/build/workspaces/gcc$ lsb_release -a
No LSB modules are available.
Distributor ID: Debian
Description: Debian GNU/Linux 5.0.2 (lenny)
Release: 5.0.2
Codename: lenny
anon@anon-laptop:~/src/0-ad/build/workspaces/gcc$ make -j3
==== Building network ====
==== Building engine ====
==== Building graphics ====
make[1]: `../../../binaries/system/libnetwork_dbg.a' не требует обновления.
==== Building i18n ====
make[1]: `../../../binaries/system/libi18n_dbg.a' не требует обновления.
==== Building atlas ====
make[1]: `../../../binaries/system/libgraphics_dbg.a' не требует обновления.
==== Building gui ====
make[1]: `../../../binaries/system/libatlas_dbg.a' не требует обновления.
==== Building lowlevel ====
lowlevel.make:634: предупреждение: переопределение команд для цели `obj/lowlevel_Debug/precompiled.h.gch'
lowlevel.make:193: предупреждение: старые команды для цели `obj/lowlevel_Debug/precompiled.h.gch' игнорируются
make[1]: `../../../binaries/system/libengine_dbg.a' не требует обновления.
==== Building AtlasObject ====
make[1]: `../../../binaries/system/libAtlasObject_dbg.a' не требует обновления.
==== Building AtlasScript ====
make[1]: `../../../binaries/system/libAtlasScript_dbg.a' не требует обновления.
==== Building wxJS ====
make[1]: `../../../binaries/system/libgui_dbg.a' не требует обновления.
==== Building Collada ====
make[1]: `../../../binaries/system/liblowlevel_dbg.a' не требует обновления.
==== Building test_gen ====
make[1]: `../../../binaries/system/libCollada_dbg.so' не требует обновления.
make[1]: `../../../binaries/system/libwxJS_dbg.a' не требует обновления.
==== Building pyrogenesis ====
==== Building AtlasUI ====
==== Building test ====
Linking pyrogenesis
precompiled.cpp
Linking AtlasUI
/usr/bin/ld: cannot find -lboost_filesystem
collect2: ld returned 1 exit status
make[1]: *** [../../../binaries/system/pyrogenesis_dbg] Ошибка 1
make: *** [pyrogenesis] Ошибка 2
make: *** Ожидание завершения заданий...
In file included from ../../../libraries/cxxtest/include/cxxtest/StdValueTraits.h:10,
from ../../../source/lib/self_test.h:189,
from ../../../source/pch/test/precompiled.h:24,
from ../../../source/pch/test/precompiled.cpp:25:
../../../libraries/cxxtest/include/cxxtest/ValueTraits.h:281: error: redefinition of ‘class CxxTest::ValueTraits<long unsigned int>’
../../../libraries/cxxtest/include/cxxtest/ValueTraits.h:266: error: previous definition of ‘class CxxTest::ValueTraits<long unsigned int>’
/usr/bin/ld: cannot find -lboost_filesystem
collect2: ld returned 1 exit status
make[1]: *** [../../../binaries/system/libAtlasUI_dbg.so] Ошибка 1
make: *** [AtlasUI] Ошибка 2
make[1]: *** [obj/test_Debug/precompiled.h.gch] Ошибка 1
make: *** [test] Ошибка 2
zsh: exit 2 make -j3
anon@anon-laptop:~/src/0-ad/build/workspaces/gcc$