Making all in common Making all in m4 Making all in codegen Making all

  1
  2
  3
  4
  5
  6
  7
  8
  9
 10
 11
 12
 13
 14
 15
 16
 17
 18
 19
 20
 21
 22
 23
 24
 25
 26
 27
 28
 29
 30
 31
 32
 33
 34
 35
 36
 37
 38
 39
 40
 41
 42
 43
 44
 45
 46
 47
 48
 49
 50
 51
 52
 53
 54
 55
 56
 57
 58
 59
 60
 61
 62
 63
 64
 65
 66
 67
 68
 69
 70
 71
 72
 73
 74
 75
 76
 77
 78
 79
 80
 81
 82
 83
 84
 85
 86
 87
 88
 89
 90
 91
 92
 93
 94
 95
 96
 97
 98
 99
100
101
102
103
104
105
106
107
108
109
110
111
112
113
114
115
116
117
118
119
120
121
122
123
124
125
126
127
128
129
130
131
132
133
134
135
136
137
138
139
140
141
142
143
144
145
146
147
148
149
150
151
152
153
154
155
156
157
158
159
160
161
162
163
164
165
166
167
168
169
170
171
172
173
174
175
176
177
178
179
180
181
182
183
184
185
186
187
188
189
190
191
192
193
194
195
196
197
198
199
200
201
202
203
204
205
206
207
208
209
210
211
212
213
214
215
216
217
218
219
220
221
222
Making all in common
Making all in m4
Making all in codegen
Making all in gst
Making all in extend
CC gst-argtypes.o
CC gstmodule.o
CC pygstiterator.o
CC pygstminiobject.o
CC pygstvalue.o
Could not write method GstStructure.get_uint: No ArgType for 'guint*'
Could not write method GstIndexEntry.assoc_map: No ArgType for 'gint64*'
Could not write getter for GstStaticCaps.caps: write_return not implemented for GstCaps
Could not write method GstTypeFind.suggest_simple: varargs functions not supported
Could not write method GstIndex.set_filter: No ArgType for 'GstIndexFilter'
Could not write method GstIndex.set_filter_full: No ArgType for 'GstIndexFilter'
Could not write method GstIndex.set_resolver: No ArgType for 'GstIndexResolver'
Could not write method GstIndex.set_resolver_full: No ArgType for 'GstIndexResolver'
Could not write method GstIndex.get_writer_id: No ArgType for 'gint*'
Could not write method GstIndex.add_associationv: No ArgType for 'const-GstIndexAssociation*'
Could not write method GstIndex.add_association: varargs functions not supported
Could not write method GstIndex.add_object: No ArgType for 'gpointer'
Could not write method GstIndex.get_assoc_entry_full: No ArgType for 'GCompareDataFunc'
Could not write virtual accessor method GstIndex.get_assoc_entry: No ArgType for 'GCompareDataFunc'
Could not write virtual proxy GstIndex.get_assoc_entry: No ArgType for 'GCompareDataFunc'
Could not write method GstElement.message_full: No ArgType for 'GQuark'
Could not write virtual accessor method GstElement.get_query_types: No ArgType for 'const-GstQueryType*'
Could not write virtual accessor method GstElement.get_state: No ArgType for 'GstState*'
Could not write virtual proxy GstElement.get_query_types: No ArgType for 'const-GstQueryType*'
Could not write virtual proxy GstElement.get_state: No ArgType for 'GstState*'
Could not write virtual accessor method GstClock.wait: No ArgType for 'GstClockEntry*'
Could not write virtual accessor method GstClock.wait_jitter: No ArgType for 'GstClockEntry*'
Could not write virtual accessor method GstClock.wait_async: No ArgType for 'GstClockEntry*'
Could not write virtual accessor method GstClock.unschedule: No ArgType for 'GstClockEntry'
Could not write virtual proxy GstClock.wait: No ArgType for 'GstClockEntry*'
Could not write virtual proxy GstClock.wait_jitter: No ArgType for 'GstClockEntry*'
Could not write virtual proxy GstClock.wait_async: No ArgType for 'GstClockEntry*'
Could not write virtual proxy GstClock.unschedule: No ArgType for 'GstClockEntry'
Could not write method GstBus.add_watch_full: No ArgType for 'GstBusFunc'
Could not write method GstPad.set_bufferalloc_function: No ArgType for 'GstPadBufferAllocFunction'
Could not write method GstPad.set_getrange_function: No ArgType for 'GstPadGetRangeFunction'
Could not write method GstPad.set_checkgetrange_function: No ArgType for 'GstPadCheckGetRangeFunction'
Could not write method GstPad.set_unlink_function: No ArgType for 'GstPadUnlinkFunction'
Could not write method GstPad.set_acceptcaps_function: No ArgType for 'GstPadAcceptCapsFunction'
Could not write method GstPad.set_fixatecaps_function: No ArgType for 'GstPadFixateCapsFunction'
Could not write method GstPad.set_internal_link_function: No ArgType for 'GstPadIntLinkFunction'
Could not write method GstPad.set_iterate_internal_links_function: No ArgType for 'GstPadIterIntLinkFunction'
Could not write method GstPad.set_query_type_function: No ArgType for 'GstPadQueryTypeFunction'
Could not write method GstPad.dispatcher: No ArgType for 'GstPadDispatcherFunction'
Warning: generating old-style constructor for:gst_ghost_pad_new
Warning: generating old-style constructor for:gst_pad_template_new
Could not write method GstPluginFeature.type_name_filter: No ArgType for 'GstTypeNameData*'
Could not write method GstRegistry.plugin_filter: No ArgType for 'GstPluginFilter'
Could not write method GstRegistry.feature_filter: No ArgType for 'GstPluginFeatureFilter'
Warning: generating old-style constructor for:gst_net_client_clock_new
Warning: generating old-style constructor for:gst_net_time_provider_new
Could not write method GstControlSource.get_value: No ArgType for 'GValue*'
Could not write method GstControlSource.get_value_array: No ArgType for 'GstValueArray*'
Could not write method GstControlSource.bind: No ArgType for 'GParamSpec*'
Could not write method GstController.get_all: No ArgType for 'const-GList*'
Could not write method GstController.get_value_arrays: No ArgType for 'GSList*'
Could not write method GstController.get_value_array: No ArgType for 'GstValueArray*'
Could not write method GstInterpolationControlSource.set: No ArgType for 'GValue*'
Could not write method GstInterpolationControlSource.set_from_list: No ArgType for 'GSList*'
Could not write method GstInterpolationControlSource.get_all: No ArgType for 'GList*'
Could not write method GstBaseSink.wait_eos: No ArgType for 'GstClockTimeDiff*'
Could not write virtual accessor method GstBaseSink.buffer_alloc: No ArgType for 'GstBuffer**'
Could not write virtual proxy GstBaseSink.buffer_alloc: No ArgType for 'GstBuffer**'
Could not write virtual accessor method GstBaseTransform.prepare_output_buffer: No ArgType for 'GstBuffer**'
Could not write virtual proxy GstBaseTransform.prepare_output_buffer: No ArgType for 'GstBuffer**'
Could not write method GstCollectPads.set_function: No ArgType for 'GstCollectPadsFunction'
Could not write method GstCollectPads.add_pad: No ArgType for 'GstCollectData*'
Could not write method GstCollectPads.add_pad_full: No ArgType for 'GstCollectDataDestroyNotify'
Could not write method GstCollectPads.peek: No ArgType for 'GstCollectData*'
Could not write method GstCollectPads.pop: No ArgType for 'GstCollectData*'
Could not write method GstCollectPads.read: No ArgType for 'GstCollectData*'
Could not write method GstCollectPads.read_buffer: No ArgType for 'GstCollectData*'
Could not write method GstCollectPads.take_buffer: No ArgType for 'GstCollectData*'
Could not write method GstCollectPads.flush: No ArgType for 'GstCollectData*'
Warning: generating old-style constructor for:gst_data_queue_new
Could not write constructor for GstDataQueue: No ArgType for 'GstDataQueueCheckFullFunction'
Could not write method GstDataQueue.push: No ArgType for 'GstDataQueueItem*'
Could not write method GstDataQueue.pop: No ArgType for 'GstDataQueueItem**'
Could not write method GstDataQueue.get_level: No ArgType for 'GstDataQueueSize*'
Could not write method GstEvent.parse_new_segment_full: No ArgType for 'gboolean*'
Could not write method GstMessage.parse_structure_change: No ArgType for 'GstStructureChangeType*'
Could not write method GstMessage.parse_request_state: No ArgType for 'GstState*'
Could not write method GstMessage.parse_buffering_stats: No ArgType for 'GstBufferingMode*'
Could not write method GstQuery.parse_buffering_percent: No ArgType for 'gboolean*'
Could not write method GstQuery.parse_buffering_stats: No ArgType for 'GstBufferingMode*'
Could not write method GstQuery.parse_buffering_range: No ArgType for 'GstFormat*'
Could not write method GstQuery.parse_uri: No ArgType for 'gchar**'
Could not write method GstTagSetter.add_tags: varargs functions not supported
Could not write method GstTagSetter.add_tag_values: varargs functions not supported
Could not write method GstTagSetter.add_tag_valist_values: No ArgType for 'va_list'
Could not write method GstPreset.get_preset_names: No ArgType for 'gchar**'
Could not write method GstPreset.get_property_names: No ArgType for 'gchar**'
Could not write method GstPreset.get_meta: No ArgType for 'gchar**'
Could not write function object_control_properties: varargs functions not supported
Could not write function object_uncontrol_properties: varargs functions not supported
Could not write function object_get_value_arrays: No ArgType for 'GSList*'
Could not write function object_get_value_array: No ArgType for 'GstValueArray*'
Could not write function gst_controller_init: No ArgType for 'int*'
Could not write function gst_dp_crc: No ArgType for 'const-guint8*'
Could not write function dp_header_from_buffer: No ArgType for 'const-GstBuffer*'
Could not write function dp_packet_from_caps: No ArgType for 'guint*'
Could not write function dp_packet_from_event: No ArgType for 'const-GstEvent*'
Could not write function type_find_helper_get_range: No ArgType for 'GstTypeFindHelperGetRangeFunction'
Could not write function debug_add_log_function: No ArgType for 'GstLogFunction'
Could not write function debug_remove_log_function: No ArgType for 'GstLogFunction'
Could not write function debug_remove_log_function_by_data: No ArgType for 'gpointer'
Could not write function debug_get_all_categories: No ArgType for 'GSList*'
Could not write function debug_remove_log_function: No ArgType for 'GstLogFunction'
Could not write function debug_remove_log_function_by_data: No ArgType for 'gpointer'
Could not write function util_array_binary_search: No ArgType for 'gpointer'
Could not write function parse_launch_full: No ArgType for 'GstParseContext*'
Could not write function parse_launchv_full: No ArgType for 'const-gchar**'
Could not write function plugin_register_static: No ArgType for 'const-GstPluginDesc*'
Could not write function poll_new_timer: No ArgType for 'GstPoll*'
Could not write function tag_register: No ArgType for 'GstTagMergeFunc'
Could not write function tag_merge_use_first: No ArgType for 'GValue*'
Could not write function tag_merge_strings_with_comma: No ArgType for 'GValue*'
Could not write function task_create: No ArgType for 'GstTaskFunction'
Warning: Constructor for GstGhostPad needs to be updated to new API
See http://live.gnome.org/PyGTK_2fWhatsNew28#update-constructors
Warning: Constructor for GstPadTemplate needs to be updated to new API
See http://live.gnome.org/PyGTK_2fWhatsNew28#update-constructors
Warning: Constructor for GstNetClientClock needs to be updated to new API
See http://live.gnome.org/PyGTK_2fWhatsNew28#update-constructors
Warning: Constructor for GstNetTimeProvider needs to be updated to new API
See http://live.gnome.org/PyGTK_2fWhatsNew28#update-constructors
Warning: Constructor for GstController needs to be updated to new API
See http://live.gnome.org/PyGTK_2fWhatsNew28#update-constructors
Warning: Constructor for GstDataQueue needs to be updated to new API
See http://live.gnome.org/PyGTK_2fWhatsNew28#update-constructors
***INFO*** The coverage of global functions is 86.41% (159/184)
***INFO*** The coverage of methods is 88.40% (480/543)
***INFO*** The coverage of virtual proxies is 86.76% (59/68)
***INFO*** The coverage of virtual accessors is 87.67% (64/73)
***INFO*** The coverage of interface proxies is 100.00% (5/5)
CC gst.o
LINK _gst.la
CC interfacesmodule.o
Could not write getter for GstTunerNorm.framerate: No ArgType for 'GValue*'
Could not write virtual accessor method GstColorBalance.list_channels: No ArgType for 'const-GList*'
Could not write interface proxy GstColorBalance.list_channels: No ArgType for 'const-GList*'
Could not write method GstMixer.volume_changed: No ArgType for 'gint*'
Could not write virtual accessor method GstMixer.list_tracks: No ArgType for 'const-GList*'
Could not write virtual accessor method GstMixer.set_volume: No ArgType for 'gint*'
Could not write virtual accessor method GstMixer.get_volume: No ArgType for 'gint*'
Could not write interface proxy GstMixer.list_tracks: No ArgType for 'const-GList*'
Could not write interface proxy GstMixer.set_volume: cannot use int* parameter with direction 'None'
Could not write interface proxy GstMixer.get_volume: cannot use int* parameter with direction 'None'
Could not write method GstPropertyProbe.probe_property: No ArgType for 'const-GParamSpec*'
Could not write method GstPropertyProbe.needs_probe: No ArgType for 'const-GParamSpec*'
Could not write method GstPropertyProbe.get_values: No ArgType for 'const-GParamSpec*'
Could not write method GstPropertyProbe.probe_and_get_values: No ArgType for 'const-GParamSpec*'
Could not write method GstPropertyProbe.probe_and_get_values_name: No ArgType for 'GValueArray*'
Could not write virtual accessor method GstPropertyProbe.get_properties: No ArgType for 'const-GList*'
Could not write virtual accessor method GstPropertyProbe.needs_probe: No ArgType for 'const-GParamSpec*'
Could not write virtual accessor method GstPropertyProbe.probe_property: No ArgType for 'const-GParamSpec*'
Could not write virtual accessor method GstPropertyProbe.get_values: No ArgType for 'const-GParamSpec*'
Could not write interface proxy GstPropertyProbe.get_properties: No ArgType for 'const-GList*'
Could not write interface proxy GstPropertyProbe.needs_probe: No ArgType for 'const-GParamSpec*'
Could not write interface proxy GstPropertyProbe.probe_property: No ArgType for 'const-GParamSpec*'
Could not write interface proxy GstPropertyProbe.get_values: No ArgType for 'GValueArray*'
Could not write virtual accessor method GstTuner.list_channels: No ArgType for 'const-GList*'
Could not write virtual accessor method GstTuner.list_norms: No ArgType for 'const-GList*'
Could not write interface proxy GstTuner.list_channels: No ArgType for 'const-GList*'
Could not write interface proxy GstTuner.list_norms: No ArgType for 'const-GList*'
Could not write function gst_mixer_message_parse_options_list_changed: No ArgType for 'GstMixerOptions**'
Could not write function navigation_query_set_commands: varargs functions not supported
Could not write function navigation_query_set_commandsv: No ArgType for 'GstNavigationCommand*'
Could not write function navigation_query_parse_commands_length: No ArgType for 'guint*'
Could not write function navigation_query_parse_commands_nth: No ArgType for 'GstNavigationCommand*'
Could not write function navigation_query_parse_angles: No ArgType for 'guint*'
Could not write function navigation_message_parse_mouse_over: No ArgType for 'gboolean*'
Could not write function navigation_message_parse_angles_changed: No ArgType for 'guint*'
Could not write function navigation_event_parse_key_event: No ArgType for 'const-gchar**'
Could not write function navigation_event_parse_mouse_button_event: No ArgType for 'gint*'
Could not write function navigation_event_parse_mouse_move_event: No ArgType for 'gdouble*'
Could not write function navigation_event_parse_command: No ArgType for 'GstNavigationCommand*'
***INFO*** The coverage of global functions is 45.45% (10/22)
***INFO*** The coverage of methods is 89.66% (52/58)
***INFO*** There are no declared virtual proxies.***INFO*** The coverage of virtual accessors is 54.55% (12/22)
***INFO*** The coverage of interface proxies is 54.55% (12/22)
CC interfaces.o
interfaces.c: In function ‘_wrap_gst_navigation_send_command’:
interfaces.c:1595: error: ‘GstNavigationCommand’ undeclared (first use in this function)
interfaces.c:1595: error: (Each undeclared identifier is reported only once
interfaces.c:1595: error: for each function it appears in.)
interfaces.c:1595: error: expected ‘;’ before ‘command’
interfaces.c:1599: error: ‘GST_TYPE_NAVIGATION_COMMAND’ undeclared (first use in this function)
interfaces.c:1599: error: ‘command’ undeclared (first use in this function)
cc1: warnings being treated as errors
interfaces.c:1602: error: implicit declaration of function ‘gst_navigation_send_command’
interfaces.c: In function ‘_wrap_gst_navigation_query_new_commands’:
interfaces.c:3280: error: implicit declaration of function ‘gst_navigation_query_new_commands’
interfaces.c:3280: error: assignment makes pointer from integer without a cast
interfaces.c: In function ‘_wrap_gst_navigation_query_new_angles’:
interfaces.c:3295: error: implicit declaration of function ‘gst_navigation_query_new_angles’
interfaces.c:3295: error: assignment makes pointer from integer without a cast
interfaces.c: In function ‘_wrap_gst_navigation_query_set_angles’:
interfaces.c:3334: error: implicit declaration of function ‘gst_navigation_query_set_angles’
interfaces.c: In function ‘_wrap_gst_navigation_message_new_mouse_over’:
interfaces.c:3352: error: implicit declaration of function ‘gst_navigation_message_new_mouse_over’
interfaces.c:3352: error: assignment makes pointer from integer without a cast
interfaces.c: In function ‘_wrap_gst_navigation_message_new_commands_changed’:
interfaces.c:3371: error: implicit declaration of function ‘gst_navigation_message_new_commands_changed’
interfaces.c:3371: error: assignment makes pointer from integer without a cast
interfaces.c: In function ‘_wrap_gst_navigation_message_new_angles_changed’:
interfaces.c:3411: error: implicit declaration of function ‘gst_navigation_message_new_angles_changed’
interfaces.c:3411: error: assignment makes pointer from integer without a cast
interfaces.c: In function ‘pyinterfaces_add_constants’:
interfaces.c:3454: error: ‘GST_TYPE_NAVIGATION_COMMAND’ undeclared (first use in this function)
interfaces.c:3455: error: ‘GST_TYPE_NAVIGATION_QUERY_TYPE’ undeclared (first use in this function)
interfaces.c:3456: error: ‘GST_TYPE_NAVIGATION_MESSAGE_TYPE’ undeclared (first use in this function)
interfaces.c:3457: error: ‘GST_TYPE_NAVIGATION_EVENT_TYPE’ undeclared (first use in this function)
make[3]: *** [interfaces_la-interfaces.lo] Error 1
make[2]: *** [all-recursive] Error 1
make[1]: *** [all-recursive] Error 1
make: *** [all] Error 2