Emerging of kde-base plasma-workspace-999 from kde checking ebuild che

  1
  2
  3
  4
  5
  6
  7
  8
  9
 10
 11
 12
 13
 14
 15
 16
 17
 18
 19
 20
 21
 22
 23
 24
 25
 26
 27
 28
 29
 30
 31
 32
 33
 34
 35
 36
 37
 38
 39
 40
 41
 42
 43
 44
 45
 46
 47
 48
 49
 50
 51
 52
 53
 54
 55
 56
 57
 58
 59
 60
 61
 62
 63
 64
 65
 66
 67
 68
 69
 70
 71
 72
 73
 74
 75
 76
 77
 78
 79
 80
 81
 82
 83
 84
 85
 86
 87
 88
 89
 90
 91
 92
 93
 94
 95
 96
 97
 98
 99
100
101
102
103
104
105
106
107
108
109
110
111
112
113
114
115
116
117
118
119
120
121
122
123
124
125
126
127
128
129
130
131
132
133
134
135
136
137
138
139
140
141
142
143
144
145
146
147
148
149
150
151
152
153
154
155
156
157
158
159
160
161
162
163
164
165
166
167
168
169
170
171
172
173
174
175
176
177
178
179
180
181
182
183
184
185
186
187
188
189
190
191
192
193
194
195
196
197
198
199
200
201
202
203
204
205
206
207
208
209
210
211
212
213
214
215
216
217
218
219
220
221
222
223
224
225
226
227
228
229
230
231
232
233
234
235
236
237
238
239
240
241
242
243
244
245
246
247
248
249
250
251
252
253
254
255
256
257
258
259
260
261
262
263
264
265
266
267
268
269
270
271
272
273
274
275
276
277
278
279
280
281
282
283
284
285
286
287
288
289
290
291
292
293
294
295
296
297
298
299
300
301
302
303
304
305
306
307
308
309
310
311
312
313
314
315
316
317
318
319
320
321
322
323
324
325
326
327
328
329
330
331
332
333
334
335
336
337
338
339
340
341
342
343
344
345
346
347
348
349
350
351
352
353
354
355
356
357
358
359
360
361
362
363
364
365
366
367
368
369
370
371
372
373
374
375
>>> Emerging (1 of 1) kde-base/plasma-workspace-9999 from kde
* checking ebuild checksums ;-) ... [ ok ]
* checking auxfile checksums ;-) ... [ ok ]
* checking miscfile checksums ;-) ... [ ok ]
>>> Unpacking source...
* Fetching disabled since 1 hours has not passed since last update.
* Using existing repository copy at revision 1025403.
* working copy: /usr/portage/distfiles/svn-src/kdebase-workspace/workspace
* Exporting parts of working copy to /var/tmp/portage/kde-base/plasma-workspace-9999/work/plasma-workspace-9999
>>> Source unpacked in /var/tmp/portage/kde-base/plasma-workspace-9999/work
>>> Preparing source in /var/tmp/portage/kde-base/plasma-workspace-9999/work/plasma-workspace-9999 ...
* Injecting library dependencies from 'libkworkspace libplasmaclock libplasmagenericshell libtaskmanager' ... [ ok ]
>>> Source prepared.
>>> Configuring source in /var/tmp/portage/kde-base/plasma-workspace-9999/work/plasma-workspace-9999 ...
>>> Working in BUILD_DIR: "/var/tmp/portage/kde-base/plasma-workspace-9999/work/plasma-workspace-9999_build"
cmake -C /var/tmp/portage/kde-base/plasma-workspace-9999/temp/gentoo_common_config.cmake -DCMAKE_INSTALL_PREFIX=/usr -DKDE4_BUILD_TESTS=OFF -DCMAKE_INSTALL_PREFIX=/usr -DSYSCONF_INSTALL_DIR=/etc -DWITH_Googlegadgets=OFF -DWITH_SIP=OFF -DWITH_PyQt4=OFF -DWITH_PyKDE4=OFF -DWITH_KdepimLibs=OFF -DWITH_Xmms=OFF -DCMAKE_BUILD_TYPE=Gentoo -DCMAKE_INSTALL_DO_STRIP=OFF -DCMAKE_USER_MAKE_RULES_OVERRIDE=/var/tmp/portage/kde-base/plasma-workspace-9999/temp/gentoo_rules.cmake /var/tmp/portage/kde-base/plasma-workspace-9999/work/plasma-workspace-9999
loading initial cache file /var/tmp/portage/kde-base/plasma-workspace-9999/temp/gentoo_common_config.cmake
-- The C compiler identification is GNU
-- The CXX compiler identification is GNU
-- Check for working C compiler: /usr/bin/i686-pc-linux-gnu-gcc
-- Check for working C compiler: /usr/bin/i686-pc-linux-gnu-gcc -- works
-- Detecting C compiler ABI info
-- Detecting C compiler ABI info - done
-- Check for working CXX compiler: /usr/bin/i686-pc-linux-gnu-g++
-- Check for working CXX compiler: /usr/bin/i686-pc-linux-gnu-g++ -- works
-- Detecting CXX compiler ABI info
-- Detecting CXX compiler ABI info - done
-- Looking for Q_WS_X11
-- Looking for Q_WS_X11 - found
-- Looking for Q_WS_WIN
-- Looking for Q_WS_WIN - not found.
-- Looking for Q_WS_QWS
-- Looking for Q_WS_QWS - not found.
-- Looking for Q_WS_MAC
-- Looking for Q_WS_MAC - not found.
-- Found Qt-Version 4.5.2 (using /usr/bin/qmake)
-- Looking for XOpenDisplay in /usr/lib/libX11.so;/usr/lib/libXext.so;/usr/lib/libXft.so;/usr/lib/libXau.so;/usr/lib/libXdmcp.so;/usr/lib/libXpm.so
-- Looking for XOpenDisplay in /usr/lib/libX11.so;/usr/lib/libXext.so;/usr/lib/libXft.so;/usr/lib/libXau.so;/usr/lib/libXdmcp.so;/usr/lib/libXpm.so - found
-- Looking for gethostbyname
-- Looking for gethostbyname - found
-- Looking for connect
-- Looking for connect - found
-- Looking for remove
-- Looking for remove - found
-- Looking for shmat
-- Looking for shmat - found
-- Looking for IceConnectionNumber in ICE
-- Looking for IceConnectionNumber in ICE - found
-- Found X11: /usr/lib/libX11.so
-- Looking for include files CMAKE_HAVE_PTHREAD_H
-- Looking for include files CMAKE_HAVE_PTHREAD_H - found
-- Looking for pthread_create in pthreads
-- Looking for pthread_create in pthreads - not found
-- Looking for pthread_create in pthread
-- Looking for pthread_create in pthread - found
-- Found Threads: TRUE
-- Found Automoc4: /usr/bin/automoc4
-- Found Perl: /usr/bin/perl
-- Phonon Version: 4.3.50
-- Found Phonon: /usr/lib/libphonon.so
-- Found Phonon Includes: /usr/include/KDE;/usr/include
-- Performing Test _OFFT_IS_64BIT
-- Performing Test _OFFT_IS_64BIT - Failed
-- Performing Test HAVE_FPIE_SUPPORT
-- Performing Test HAVE_FPIE_SUPPORT - Success
-- Performing Test __KDE_HAVE_W_OVERLOADED_VIRTUAL
-- Performing Test __KDE_HAVE_W_OVERLOADED_VIRTUAL - Success
-- Performing Test __KDE_HAVE_GCC_VISIBILITY
-- Performing Test __KDE_HAVE_GCC_VISIBILITY - Success
-- Found KDE 4.4 include dir: /usr/include
-- Found KDE 4.4 library dir: /usr/lib
-- Found the KDE4 kconfig_compiler preprocessor: /usr/bin/kconfig_compiler
-- Found automoc4: /usr/bin/automoc4
-- Strigi API needs 'signed char'
-- Found Strigi: /usr/lib/libstreams.so
-- found qimageblitz, version 4.0.0
-- Found QImageBlitz: /usr/include/qimageblitz
-- Found ZLIB: /lib/libz.so
-- WARNING: you are using the obsolete 'PKGCONFIG' macro use FindPkgConfig
-- Found GLIB2: /usr/lib/libglib-2.0.so
-- found fontconfig, version 2.7.3
-- Found Fontconfig: /usr/lib/libfontconfig.so
-- checking for modules 'eet;qzion>=0.4.0;qedje>=0.4.0'
-- package 'eet' not found
-- package 'qzion>=0.4.0' not found
-- package 'qedje>=0.4.0' not found
-- Could not find QZion and/or QEdje and/or eet. Please download them here (http://code.openbossa.org/projects/qedje/pages/Home).
-- Could NOT find QEdje (missing: QEDJE_LIBRARIES QEDJE_INCLUDE_DIRS)
-- Found PythonInterp: /usr/bin/python
-- Found Python executable: /usr/bin/python
-- Found Python version: 2.6.2
-- Found Python library: /usr/lib/libpython2.6.so
-- Found Soprano version 2.3.60: /usr/lib/libsoprano.so
-- Found Soprano includes: /usr/include
-- Found Soprano Index: /usr/lib/libsopranoindex.so
-- Found Soprano Client: /usr/lib/libsopranoclient.so
-- Found Soprano Plugin Dir: /usr/share/soprano/plugins
-- Found Soprano Plugins: nquadparser nquadserializer raptorparser raptorserializer sesame2backend
-- Found NEPOMUK: /usr/lib/libnepomuk.so
-- found polkit-qt, version 0.9.2
-- Found PolkitQt: /usr/lib/libpolkit-qt-gui.so;/usr/lib/libpolkit-qt-core.so
-- Performing Test PAM_MESSAGE_CONST
-- Performing Test PAM_MESSAGE_CONST - Success
-- Found PAM: /lib/libpam.so;/usr/lib/libdl.so
-- Looking for getspnam
-- Looking for getspnam - found
-- Looking for crypt in crypt
-- Looking for crypt in crypt - found
-- Looking for include files HAVE_CRYPT_H
-- Looking for include files HAVE_CRYPT_H - found
-- Looking for XkbLockModifiers in X11
-- Looking for XkbLockModifiers in X11 - found
-- Looking for getpassphrase
-- Looking for getpassphrase - not found
-- Looking for vsyslog
-- Looking for vsyslog - found
-- Looking for statvfs
-- Looking for statvfs - found
-- Looking for include files HAVE_LIMITS_H
-- Looking for include files HAVE_LIMITS_H - found
-- Looking for include files HAVE_SYS_TIME_H
-- Looking for include files HAVE_SYS_TIME_H - found
-- Looking for include files HAVE_STDINT_H
-- Looking for include files HAVE_STDINT_H - found
-- Looking for include files HAVE_SYS_VFS_H
-- Looking for include files HAVE_SYS_VFS_H - found
-- Looking for include files HAVE_SYS_STATVFS_H
-- Looking for include files HAVE_SYS_STATVFS_H - found
-- Looking for include files HAVE_SYS_PARAM_H
-- Looking for include files HAVE_SYS_PARAM_H - found
-- Looking for include files HAVE_SYS_MOUNT_H
-- Looking for include files HAVE_SYS_MOUNT_H - found
-- Looking for include files HAVE_SYS_STATFS_H
-- Looking for include files HAVE_SYS_STATFS_H - found
-- Looking for statfs
-- Looking for statfs - found
-- Looking for sys/types.h
-- Looking for sys/types.h - found
-- Looking for stddef.h
-- Looking for stddef.h - found
-- Check size of struct ucred
-- Check size of struct ucred - failed
-- Looking for getpeereid
-- Looking for getpeereid - not found
-- Looking for setpriority
-- Looking for setpriority - found
-- checking for module 'xrandr>=1.2'
-- found xrandr, version 1.3.0
-- Looking for XScreenSaverQueryInfo in Xss
-- Looking for XScreenSaverQueryInfo in Xss - found
-- Could NOT find libgps (missing: LIBGPS_INCLUDE_DIR LIBGPS_LIBRARIES)
-- Could NOT find XMMS: the nowplaying dataengine will NOT support XMMS 1.x
-- Found Soprano version 2.3.60: /usr/lib/libsoprano.so
-- Found Soprano includes: /usr/include
-- Found Soprano Index: /usr/lib/libsopranoindex.so
-- Found Soprano Client: /usr/lib/libsopranoclient.so
-- Found Soprano Plugin Dir: /usr/share/soprano/plugins/soprano/plugins
-- Found Soprano Plugins: nquadparser nquadserializer raptorparser raptorserializer sesame2backend
-----------------------------------------------------------------------------
-- The following external packages were located on your system.
-- This installation will have the extra features provided by these packages.
-----------------------------------------------------------------------------
* glib2 - Low-level core library for data structure handling, portability wrappers, etc.
* Soprano - Semantic Desktop Storing
* Nepomuk - Nepomuk Libraries
* Polkit-Qt - Qt Wrapper around PolicyKit
* libxss - XScreenSaver Library
* libxext - XSync Extension
* Soprano - Soprano Libraries
-----------------------------------------------------------------------------
-- The following OPTIONAL packages could NOT be located on your system.
-- Consider installing them to enable more features from this software.
-----------------------------------------------------------------------------
* GoogleGadgets <http://code.google.com/p/google-gadgets-for-linux/>
Google Gadgets library
Needed to build plasma scriptengine for google gadgets
* QEdje <http://code.openbossa.org/projects/qedje/pages/Home>
QEdje library
Needed to build plasma scriptengine for edje files
* Python <http://techbase.kde.org/Development/Languages/Python>
KDE Python support
Needed to build plasma scriptengine for Python
* libgps <http://gpsd.berlios.de/>
GPS support for geolocation
* XMMS <http://www.xmms.org>
X MultiMedia System developement libraries
Support for XMMS in the Now Playing data engine
* kdepimlibs <http://www.kde.org>
KDE PIM libraries
Needed for building several plasma dataengines
-----------------------------------------------------------------------------
-- <<< Gentoo configuration >>>
Build type: Gentoo
Install path: /usr
-- Configuring done
-- Generating done
-- Build files have been written to: /var/tmp/portage/kde-base/plasma-workspace-9999/work/plasma-workspace-9999_build
>>> Source configured.
>>> Compiling source in /var/tmp/portage/kde-base/plasma-workspace-9999/work/plasma-workspace-9999 ...
>>> Working in BUILD_DIR: "/var/tmp/portage/kde-base/plasma-workspace-9999/work/plasma-workspace-9999_build"
make -j2 -j1 -s
Scanning dependencies of target nepomukquery_automoc
[ 0%] Built target nepomukquery_automoc
Scanning dependencies of target nepomukquery
[ 0%] Building CXX object libs/nepomukquery/CMakeFiles/nepomukquery.dir/nepomukquery_automoc.o
[ 0%] Building CXX object libs/nepomukquery/CMakeFiles/nepomukquery.dir/result.o
[ 0%] Building CXX object libs/nepomukquery/CMakeFiles/nepomukquery.dir/term.o
[ 0%] Building CXX object libs/nepomukquery/CMakeFiles/nepomukquery.dir/query.o
[ 1%] Building CXX object libs/nepomukquery/CMakeFiles/nepomukquery.dir/queryparser.o
[ 1%] Building CXX object libs/nepomukquery/CMakeFiles/nepomukquery.dir/dbusoperators.o
/var/tmp/portage/kde-base/plasma-workspace-9999/work/plasma-workspace-9999/libs/nepomukquery/dbusoperators.cpp: In function ‘const QDBusArgument& operator>>(const QDBusArgument&, Soprano::Node&)’:
/var/tmp/portage/kde-base/plasma-workspace-9999/work/plasma-workspace-9999/libs/nepomukquery/dbusoperators.cpp:332: предупреждение: ‘Soprano::Node::Node(const Soprano::LiteralValue&, const QString&)’ is deprecated (declared at /usr/include/Soprano/../soprano/node.h:121)
Linking CXX shared library ../../lib/libnepomukquery.so
[ 1%] Built target nepomukquery
Scanning dependencies of target nepomukqueryclient_automoc
Generating queryserviceclient.moc
[ 1%] Built target nepomukqueryclient_automoc
[ 1%] Generating queryinterface.cpp, queryinterface.h
[ 2%] Generating queryinterface.moc
[ 2%] Generating queryserviceinterface.cpp, queryserviceinterface.h
[ 2%] Generating queryserviceinterface.moc
Scanning dependencies of target nepomukqueryclient
[ 2%] Building CXX object libs/nepomukqueryclient/CMakeFiles/nepomukqueryclient.dir/nepomukqueryclient_automoc.o
[ 2%] Building CXX object libs/nepomukqueryclient/CMakeFiles/nepomukqueryclient.dir/queryserviceclient.o
[ 2%] Building CXX object libs/nepomukqueryclient/CMakeFiles/nepomukqueryclient.dir/queryserviceinterface.o
[ 3%] Building CXX object libs/nepomukqueryclient/CMakeFiles/nepomukqueryclient.dir/queryinterface.o
Linking CXX shared library ../../lib/libnepomukqueryclient.so
[ 3%] Built target nepomukqueryclient
Scanning dependencies of target plasma_containment_desktop_automoc
Generating desktop.moc
Generating desktoplayout.moc
[ 3%] Built target plasma_containment_desktop_automoc
Scanning dependencies of target plasma_containment_desktop
[ 3%] Building CXX object plasma/desktop/containments/desktop/CMakeFiles/plasma_containment_desktop.dir/plasma_containment_desktop_automoc.o
[ 3%] Building CXX object plasma/desktop/containments/desktop/CMakeFiles/plasma_containment_desktop.dir/desktop.o
[ 3%] Building CXX object plasma/desktop/containments/desktop/CMakeFiles/plasma_containment_desktop.dir/itemspace.o
/var/tmp/portage/kde-base/plasma-workspace-9999/work/plasma-workspace-9999/plasma/desktop/containments/desktop/itemspace.cpp: In member function ‘void ItemSpace::ItemGroup::Request::activate(ItemSpace*, ItemSpace::ItemGroup*)’:
/var/tmp/portage/kde-base/plasma-workspace-9999/work/plasma-workspace-9999/plasma/desktop/containments/desktop/itemspace.cpp:505: предупреждение: ‘push’, возможно, используется без инициализации в данной функции
/var/tmp/portage/kde-base/plasma-workspace-9999/work/plasma-workspace-9999/plasma/desktop/containments/desktop/itemspace.cpp:469: предупреждение: ‘limit’, возможно, используется без инициализации в данной функции
[ 3%] Building CXX object plasma/desktop/containments/desktop/CMakeFiles/plasma_containment_desktop.dir/desktoplayout.o
Linking CXX shared module ../../../../lib/plasma_containment_desktop.so
[ 3%] Built target plasma_containment_desktop
Scanning dependencies of target plasma_containment_panel_automoc
Generating panel.moc
[ 3%] Built target plasma_containment_panel_automoc
Scanning dependencies of target plasma_containment_panel
[ 4%] Building CXX object plasma/desktop/containments/panel/CMakeFiles/plasma_containment_panel.dir/plasma_containment_panel_automoc.o
[ 4%] Building CXX object plasma/desktop/containments/panel/CMakeFiles/plasma_containment_panel.dir/panel.o
Linking CXX shared module ../../../../lib/plasma_containment_panel.so
[ 4%] Built target plasma_containment_panel
Scanning dependencies of target kdeinit_plasma-desktop_automoc
Generating scriptengine.moc
Generating desktopview.moc
Generating panelcontroller.moc
Generating positioningruler.moc
Generating containment.moc
Generating checkbox.moc
Generating panelappletoverlay.moc
Generating interactiveconsole.moc
Generating panelview.moc
Generating widget.moc
Generating controllerwindow.moc
Generating plasmaapp.moc
Generating dashboardview.moc
Generating toolbutton.moc
Generating desktopcorona.moc
[ 4%] Built target kdeinit_plasma-desktop_automoc
[ 4%] Generating ksmserver_interface.cpp, ksmserver_interface.h
[ 5%] Generating ksmserver_interface.moc
[ 6%] Generating ui_globaloptions.h
[ 6%] Generating plasma-shell-desktop.h, plasma-shell-desktop.cpp
[ 6%] Generating appadaptor.cpp, appadaptor.h
[ 6%] Generating appadaptor.moc
Scanning dependencies of target kdeinit_plasma-desktop
[ 6%] Building CXX object plasma/desktop/shell/CMakeFiles/kdeinit_plasma-desktop.dir/kdeinit_plasma-desktop_automoc.o
[ 6%] Building CXX object plasma/desktop/shell/CMakeFiles/kdeinit_plasma-desktop.dir/scripting/containment.o
[ 6%] Building CXX object plasma/desktop/shell/CMakeFiles/kdeinit_plasma-desktop.dir/scripting/rect.o
/var/tmp/portage/kde-base/plasma-workspace-9999/work/plasma-workspace-9999/plasma/desktop/shell/scripting/rect.cpp:54: предупреждение: ‘QScriptValue adjusted(QScriptContext*, QScriptEngine*)’ определена, но нигде не используется
[ 7%] Building CXX object plasma/desktop/shell/CMakeFiles/kdeinit_plasma-desktop.dir/scripting/scriptengine.o
[ 7%] Building CXX object plasma/desktop/shell/CMakeFiles/kdeinit_plasma-desktop.dir/scripting/widget.o
/var/tmp/portage/kde-base/plasma-workspace-9999/work/plasma-workspace-9999/plasma/desktop/shell/scripting/widget.cpp:163: предупреждение: параметр ‘geometry’ не используется
[ 7%] Building CXX object plasma/desktop/shell/CMakeFiles/kdeinit_plasma-desktop.dir/checkbox.o
[ 7%] Building CXX object plasma/desktop/shell/CMakeFiles/kdeinit_plasma-desktop.dir/controllerwindow.o
[ 8%] Building CXX object plasma/desktop/shell/CMakeFiles/kdeinit_plasma-desktop.dir/dashboardview.o
[ 8%] Building CXX object plasma/desktop/shell/CMakeFiles/kdeinit_plasma-desktop.dir/desktopcorona.o
[ 8%] Building CXX object plasma/desktop/shell/CMakeFiles/kdeinit_plasma-desktop.dir/desktopview.o
[ 8%] Building CXX object plasma/desktop/shell/CMakeFiles/kdeinit_plasma-desktop.dir/interactiveconsole.o
[ 8%] Building CXX object plasma/desktop/shell/CMakeFiles/kdeinit_plasma-desktop.dir/main.o
[ 9%] Building CXX object plasma/desktop/shell/CMakeFiles/kdeinit_plasma-desktop.dir/panelcontroller.o
[ 9%] Building CXX object plasma/desktop/shell/CMakeFiles/kdeinit_plasma-desktop.dir/panelview.o
[ 9%] Building CXX object plasma/desktop/shell/CMakeFiles/kdeinit_plasma-desktop.dir/panelappletoverlay.o
[ 9%] Building CXX object plasma/desktop/shell/CMakeFiles/kdeinit_plasma-desktop.dir/plasmaapp.o
[ 10%] Building CXX object plasma/desktop/shell/CMakeFiles/kdeinit_plasma-desktop.dir/positioningruler.o
[ 10%] Building CXX object plasma/desktop/shell/CMakeFiles/kdeinit_plasma-desktop.dir/toolbutton.o
[ 10%] Building CXX object plasma/desktop/shell/CMakeFiles/kdeinit_plasma-desktop.dir/plasma-shell-desktop.o
[ 10%] Building CXX object plasma/desktop/shell/CMakeFiles/kdeinit_plasma-desktop.dir/appadaptor.o
[ 10%] Building CXX object plasma/desktop/shell/CMakeFiles/kdeinit_plasma-desktop.dir/ksmserver_interface.o
Linking CXX shared library ../../../lib/libkdeinit4_plasma-desktop.so
CMakeFiles/kdeinit_plasma-desktop.dir/controllerwindow.o: In function `ControllerWindow::showWidgetExplorer()':
controllerwindow.cpp:(.text+0x391): undefined reference to `Plasma::WidgetExplorer::setOrientation(Qt::Orientation)'
controllerwindow.cpp:(.text+0x4a2): undefined reference to `Plasma::WidgetExplorer::WidgetExplorer(QGraphicsItem*)'
controllerwindow.cpp:(.text+0x4b4): undefined reference to `Plasma::WidgetExplorer::setContainment(Plasma::Containment*)'
controllerwindow.cpp:(.text+0x4d5): undefined reference to `Plasma::WidgetExplorer::setApplication(QString const&)'
CMakeFiles/kdeinit_plasma-desktop.dir/controllerwindow.o: In function `ControllerWindow::setLocation(Plasma::Location const&)':
controllerwindow.cpp:(.text+0x72e): undefined reference to `Plasma::WidgetExplorer::setOrientation(Qt::Orientation)'
controllerwindow.cpp:(.text+0x794): undefined reference to `Plasma::WidgetExplorer::setOrientation(Qt::Orientation)'
CMakeFiles/kdeinit_plasma-desktop.dir/controllerwindow.o: In function `ControllerWindow::setContainment(Plasma::Containment*)':
controllerwindow.cpp:(.text+0x8b9): undefined reference to `Plasma::WidgetExplorer::setContainment(Plasma::Containment*)'
collect2: выполнение ld завершилось с кодом возврата 1
make[2]: *** [lib/libkdeinit4_plasma-desktop.so] Ошибка 1
make[1]: *** [plasma/desktop/shell/CMakeFiles/kdeinit_plasma-desktop.dir/all] Ошибка 2
make: *** [all] Ошибка 2
*
* ERROR: kde-base/plasma-workspace-9999 failed.
* Call stack:
* ebuild.sh, line 49: Called src_compile
* environment, line 4665: Called kde4-meta_src_compile
* environment, line 3244: Called kde4-base_src_compile
* environment, line 2938: Called cmake-utils_src_compile
* environment, line 1165: Called cmake-utils_src_make
* environment, line 1245: Called die
* The specific snippet of code:
* emake "$@" || die "Make failed!";
* The die message:
* Make failed!
*
* If you need support, post the topmost build error, and the call stack if relevant.
* A complete build log is located at '/var/tmp/portage/kde-base/plasma-workspace-9999/temp/build.log'.
* The ebuild environment file is located at '/var/tmp/portage/kde-base/plasma-workspace-9999/temp/environment'.
* This ebuild used the following eclasses from overlays:
* /usr/local/portage/layman/kde-testing/eclass/kde4-meta.eclass
* /usr/local/portage/layman/kde-testing/eclass/kde4-base.eclass
* /usr/local/portage/layman/kde-testing/eclass/kde4-functions.eclass
* This ebuild is from an overlay named 'kde': '/usr/local/portage/layman/kde-testing/'
*
>>> Failed to emerge kde-base/plasma-workspace-9999, Log file:
>>> '/var/tmp/portage/kde-base/plasma-workspace-9999/temp/build.log'
* Messages for package kde-base/plasma-workspace-9999:
*
* ERROR: kde-base/plasma-workspace-9999 failed.
* Call stack:
* ebuild.sh, line 49: Called src_compile
* environment, line 4665: Called kde4-meta_src_compile
* environment, line 3244: Called kde4-base_src_compile
* environment, line 2938: Called cmake-utils_src_compile
* environment, line 1165: Called cmake-utils_src_make
* environment, line 1245: Called die
* The specific snippet of code:
* emake "$@" || die "Make failed!";
* The die message:
* Make failed!
*
* If you need support, post the topmost build error, and the call stack if relevant.
* A complete build log is located at '/var/tmp/portage/kde-base/plasma-workspace-9999/temp/build.log'.
* The ebuild environment file is located at '/var/tmp/portage/kde-base/plasma-workspace-9999/temp/environment'.
* This ebuild used the following eclasses from overlays:
* /usr/local/portage/layman/kde-testing/eclass/kde4-meta.eclass
* /usr/local/portage/layman/kde-testing/eclass/kde4-base.eclass
* /usr/local/portage/layman/kde-testing/eclass/kde4-functions.eclass
* This ebuild is from an overlay named 'kde': '/usr/local/portage/layman/kde-testing/'
*
*
* The following package has failed to build or install:
*
* ('ebuild', '/', 'kde-base/plasma-workspace-9999', 'merge')