shadow will be compiled with the following features auditing support n

  1
  2
  3
  4
  5
  6
  7
  8
  9
 10
 11
 12
 13
 14
 15
 16
 17
 18
 19
 20
 21
 22
 23
 24
 25
 26
 27
 28
 29
 30
 31
 32
 33
 34
 35
 36
 37
 38
 39
 40
 41
 42
 43
 44
 45
 46
 47
 48
 49
 50
 51
 52
 53
 54
 55
 56
 57
 58
 59
 60
 61
 62
 63
 64
 65
 66
 67
 68
 69
 70
 71
 72
 73
 74
 75
 76
 77
 78
 79
 80
 81
 82
 83
 84
 85
 86
 87
 88
 89
 90
 91
 92
 93
 94
 95
 96
 97
 98
 99
100
101
102
103
104
105
106
107
108
109
110
111
112
113
114
115
116
117
118
119
120
121
122
123
124
125
126
127
128
129
130
131
132
133
134
135
136
137
138
139
140
141
142
143
144
145
146
147
148
149
150
151
152
153
154
155
156
157
158
159
160
161
162
163
164
165
166
167
168
169
170
171
172
173
174
175
176
177
178
179
180
181
182
183
184
185
186
187
188
189
190
191
192
193
194
195
196
197
198
199
200
201
202
203
204
205
206
207
208
209
210
211
212
213
214
215
216
shadow will be compiled with the following features:
auditing support: no
CrackLib support: yes
PAM support: yes
SELinux support: no
shadow group support: yes
S/Key support: no
SHA passwords encryption: yes
make -j3
make all-recursive
make[1]: Entering directory `/var/tmp/portage/sys-apps/shadow-4.1.2.2/work/shadow-4.1.2.2'
Making all in po
make[2]: Entering directory `/var/tmp/portage/sys-apps/shadow-4.1.2.2/work/shadow-4.1.2.2/po'
make[2]: Цель `all' не требует выполнения команд.
make[2]: Leaving directory `/var/tmp/portage/sys-apps/shadow-4.1.2.2/work/shadow-4.1.2.2/po'
Making all in man
make[2]: Entering directory `/var/tmp/portage/sys-apps/shadow-4.1.2.2/work/shadow-4.1.2.2/man'
Making all in po
make[3]: Entering directory `/var/tmp/portage/sys-apps/shadow-4.1.2.2/work/shadow-4.1.2.2/man/po'
make[3]: Цель `all' не требует выполнения команд.
make[3]: Leaving directory `/var/tmp/portage/sys-apps/shadow-4.1.2.2/work/shadow-4.1.2.2/man/po'
Making all in cs
make[3]: Entering directory `/var/tmp/portage/sys-apps/shadow-4.1.2.2/work/shadow-4.1.2.2/man/cs'
make[3]: Цель `all' не требует выполнения команд.
make[3]: Leaving directory `/var/tmp/portage/sys-apps/shadow-4.1.2.2/work/shadow-4.1.2.2/man/cs'
Making all in de
make[3]: Entering directory `/var/tmp/portage/sys-apps/shadow-4.1.2.2/work/shadow-4.1.2.2/man/de'
make[3]: Цель `all' не требует выполнения команд.
make[3]: Leaving directory `/var/tmp/portage/sys-apps/shadow-4.1.2.2/work/shadow-4.1.2.2/man/de'
Making all in es
make[3]: Entering directory `/var/tmp/portage/sys-apps/shadow-4.1.2.2/work/shadow-4.1.2.2/man/es'
make[3]: Цель `all' не требует выполнения команд.
make[3]: Leaving directory `/var/tmp/portage/sys-apps/shadow-4.1.2.2/work/shadow-4.1.2.2/man/es'
Making all in fi
make[3]: Entering directory `/var/tmp/portage/sys-apps/shadow-4.1.2.2/work/shadow-4.1.2.2/man/fi'
make[3]: Цель `all' не требует выполнения команд.
make[3]: Leaving directory `/var/tmp/portage/sys-apps/shadow-4.1.2.2/work/shadow-4.1.2.2/man/fi'
Making all in fr
make[3]: Entering directory `/var/tmp/portage/sys-apps/shadow-4.1.2.2/work/shadow-4.1.2.2/man/fr'
make[3]: Цель `all' не требует выполнения команд.
make[3]: Leaving directory `/var/tmp/portage/sys-apps/shadow-4.1.2.2/work/shadow-4.1.2.2/man/fr'
Making all in hu
make[3]: Entering directory `/var/tmp/portage/sys-apps/shadow-4.1.2.2/work/shadow-4.1.2.2/man/hu'
make[3]: Цель `all' не требует выполнения команд.
make[3]: Leaving directory `/var/tmp/portage/sys-apps/shadow-4.1.2.2/work/shadow-4.1.2.2/man/hu'
Making all in id
make[3]: Entering directory `/var/tmp/portage/sys-apps/shadow-4.1.2.2/work/shadow-4.1.2.2/man/id'
make[3]: Цель `all' не требует выполнения команд.
make[3]: Leaving directory `/var/tmp/portage/sys-apps/shadow-4.1.2.2/work/shadow-4.1.2.2/man/id'
Making all in it
make[3]: Entering directory `/var/tmp/portage/sys-apps/shadow-4.1.2.2/work/shadow-4.1.2.2/man/it'
make[3]: Цель `all' не требует выполнения команд.
make[3]: Leaving directory `/var/tmp/portage/sys-apps/shadow-4.1.2.2/work/shadow-4.1.2.2/man/it'
Making all in ja
make[3]: Entering directory `/var/tmp/portage/sys-apps/shadow-4.1.2.2/work/shadow-4.1.2.2/man/ja'
make[3]: Цель `all' не требует выполнения команд.
make[3]: Leaving directory `/var/tmp/portage/sys-apps/shadow-4.1.2.2/work/shadow-4.1.2.2/man/ja'
Making all in ko
make[3]: Entering directory `/var/tmp/portage/sys-apps/shadow-4.1.2.2/work/shadow-4.1.2.2/man/ko'
make[3]: Цель `all' не требует выполнения команд.
make[3]: Leaving directory `/var/tmp/portage/sys-apps/shadow-4.1.2.2/work/shadow-4.1.2.2/man/ko'
Making all in pl
make[3]: Entering directory `/var/tmp/portage/sys-apps/shadow-4.1.2.2/work/shadow-4.1.2.2/man/pl'
make[3]: Цель `all' не требует выполнения команд.
make[3]: Leaving directory `/var/tmp/portage/sys-apps/shadow-4.1.2.2/work/shadow-4.1.2.2/man/pl'
Making all in pt_BR
make[3]: Entering directory `/var/tmp/portage/sys-apps/shadow-4.1.2.2/work/shadow-4.1.2.2/man/pt_BR'
make[3]: Цель `all' не требует выполнения команд.
make[3]: Leaving directory `/var/tmp/portage/sys-apps/shadow-4.1.2.2/work/shadow-4.1.2.2/man/pt_BR'
Making all in ru
make[3]: Entering directory `/var/tmp/portage/sys-apps/shadow-4.1.2.2/work/shadow-4.1.2.2/man/ru'
make[3]: Цель `all' не требует выполнения команд.
make[3]: Leaving directory `/var/tmp/portage/sys-apps/shadow-4.1.2.2/work/shadow-4.1.2.2/man/ru'
Making all in sv
make[3]: Entering directory `/var/tmp/portage/sys-apps/shadow-4.1.2.2/work/shadow-4.1.2.2/man/sv'
make[3]: Цель `all' не требует выполнения команд.
make[3]: Leaving directory `/var/tmp/portage/sys-apps/shadow-4.1.2.2/work/shadow-4.1.2.2/man/sv'
Making all in tr
make[3]: Entering directory `/var/tmp/portage/sys-apps/shadow-4.1.2.2/work/shadow-4.1.2.2/man/tr'
make[3]: Цель `all' не требует выполнения команд.
make[3]: Leaving directory `/var/tmp/portage/sys-apps/shadow-4.1.2.2/work/shadow-4.1.2.2/man/tr'
Making all in zh_CN
make[3]: Entering directory `/var/tmp/portage/sys-apps/shadow-4.1.2.2/work/shadow-4.1.2.2/man/zh_CN'
make[3]: Цель `all' не требует выполнения команд.
make[3]: Leaving directory `/var/tmp/portage/sys-apps/shadow-4.1.2.2/work/shadow-4.1.2.2/man/zh_CN'
Making all in zh_TW
make[3]: Entering directory `/var/tmp/portage/sys-apps/shadow-4.1.2.2/work/shadow-4.1.2.2/man/zh_TW'
make[3]: Цель `all' не требует выполнения команд.
make[3]: Leaving directory `/var/tmp/portage/sys-apps/shadow-4.1.2.2/work/shadow-4.1.2.2/man/zh_TW'
make[3]: Entering directory `/var/tmp/portage/sys-apps/shadow-4.1.2.2/work/shadow-4.1.2.2/man'
make[3]: Цель `all-am' не требует выполнения команд.
make[3]: Leaving directory `/var/tmp/portage/sys-apps/shadow-4.1.2.2/work/shadow-4.1.2.2/man'
make[2]: Leaving directory `/var/tmp/portage/sys-apps/shadow-4.1.2.2/work/shadow-4.1.2.2/man'
Making all in libmisc
make[2]: Entering directory `/var/tmp/portage/sys-apps/shadow-4.1.2.2/work/shadow-4.1.2.2/libmisc'
i686-pc-linux-gnu-gcc -DHAVE_CONFIG_H -I. -I.. -I../lib -march=prescott -O2 -pipe -fomit-frame-pointer -MT addgrps.o -MD -MP -MF .deps/addgrps.Tpo -c -o addgrps.o addgrps.c
i686-pc-linux-gnu-gcc -DHAVE_CONFIG_H -I. -I.. -I../lib -march=prescott -O2 -pipe -fomit-frame-pointer -MT age.o -MD -MP -MF .deps/age.Tpo -c -o age.o age.c
i686-pc-linux-gnu-gcc -DHAVE_CONFIG_H -I. -I.. -I../lib -march=prescott -O2 -pipe -fomit-frame-pointer -MT audit_help.o -MD -MP -MF .deps/audit_help.Tpo -c -o audit_help.o audit_help.c
mv -f .deps/age.Tpo .deps/age.Po
i686-pc-linux-gnu-gcc -DHAVE_CONFIG_H -I. -I.. -I../lib -march=prescott -O2 -pipe -fomit-frame-pointer -MT basename.o -MD -MP -MF .deps/basename.Tpo -c -o basename.o basename.c
mv -f .deps/audit_help.Tpo .deps/audit_help.Po
i686-pc-linux-gnu-gcc -DHAVE_CONFIG_H -I. -I.. -I../lib -march=prescott -O2 -pipe -fomit-frame-pointer -MT chkname.o -MD -MP -MF .deps/chkname.Tpo -c -o chkname.o chkname.c
mv -f .deps/basename.Tpo .deps/basename.Po
i686-pc-linux-gnu-gcc -DHAVE_CONFIG_H -I. -I.. -I../lib -march=prescott -O2 -pipe -fomit-frame-pointer -MT chowndir.o -MD -MP -MF .deps/chowndir.Tpo -c -o chowndir.o chowndir.c
mv -f .deps/addgrps.Tpo .deps/addgrps.Po
i686-pc-linux-gnu-gcc -DHAVE_CONFIG_H -I. -I.. -I../lib -march=prescott -O2 -pipe -fomit-frame-pointer -MT chowntty.o -MD -MP -MF .deps/chowntty.Tpo -c -o chowntty.o chowntty.c
mv -f .deps/chowndir.Tpo .deps/chowndir.Po
i686-pc-linux-gnu-gcc -DHAVE_CONFIG_H -I. -I.. -I../lib -march=prescott -O2 -pipe -fomit-frame-pointer -MT console.o -MD -MP -MF .deps/console.Tpo -c -o console.o console.c
mv -f .deps/chkname.Tpo .deps/chkname.Po
mv -f .deps/chowntty.Tpo .deps/chowntty.Po
i686-pc-linux-gnu-gcc -DHAVE_CONFIG_H -I. -I.. -I../lib -march=prescott -O2 -pipe -fomit-frame-pointer -MT copydir.o -MD -MP -MF .deps/copydir.Tpo -c -o copydir.o copydir.c
mv -f .deps/console.Tpo .deps/console.Po
i686-pc-linux-gnu-gcc -DHAVE_CONFIG_H -I. -I.. -I../lib -march=prescott -O2 -pipe -fomit-frame-pointer -MT entry.o -MD -MP -MF .deps/entry.Tpo -c -o entry.o entry.c
i686-pc-linux-gnu-gcc -DHAVE_CONFIG_H -I. -I.. -I../lib -march=prescott -O2 -pipe -fomit-frame-pointer -MT env.o -MD -MP -MF .deps/env.Tpo -c -o env.o env.c
mv -f .deps/entry.Tpo .deps/entry.Po
i686-pc-linux-gnu-gcc -DHAVE_CONFIG_H -I. -I.. -I../lib -march=prescott -O2 -pipe -fomit-frame-pointer -MT failure.o -MD -MP -MF .deps/failure.Tpo -c -o failure.o failure.c
mv -f .deps/copydir.Tpo .deps/copydir.Po
i686-pc-linux-gnu-gcc -DHAVE_CONFIG_H -I. -I.. -I../lib -march=prescott -O2 -pipe -fomit-frame-pointer -MT fields.o -MD -MP -MF .deps/fields.Tpo -c -o fields.o fields.c
mv -f .deps/env.Tpo .deps/env.Po
i686-pc-linux-gnu-gcc -DHAVE_CONFIG_H -I. -I.. -I../lib -march=prescott -O2 -pipe -fomit-frame-pointer -MT find_new_ids.o -MD -MP -MF .deps/find_new_ids.Tpo -c -o find_new_ids.o find_new_ids.c
mv -f .deps/failure.Tpo .deps/failure.Po
i686-pc-linux-gnu-gcc -DHAVE_CONFIG_H -I. -I.. -I../lib -march=prescott -O2 -pipe -fomit-frame-pointer -MT getdate.o -MD -MP -MF .deps/getdate.Tpo -c -o getdate.o getdate.c
mv -f .deps/fields.Tpo .deps/fields.Po
i686-pc-linux-gnu-gcc -DHAVE_CONFIG_H -I. -I.. -I../lib -march=prescott -O2 -pipe -fomit-frame-pointer -MT getlong.o -MD -MP -MF .deps/getlong.Tpo -c -o getlong.o getlong.c
mv -f .deps/getlong.Tpo .deps/getlong.Po
mv -f .deps/find_new_ids.Tpo .deps/find_new_ids.Po
i686-pc-linux-gnu-gcc -DHAVE_CONFIG_H -I. -I.. -I../lib -march=prescott -O2 -pipe -fomit-frame-pointer -MT hushed.o -MD -MP -MF .deps/hushed.Tpo -c -o hushed.o hushed.c
i686-pc-linux-gnu-gcc -DHAVE_CONFIG_H -I. -I.. -I../lib -march=prescott -O2 -pipe -fomit-frame-pointer -MT isexpired.o -MD -MP -MF .deps/isexpired.Tpo -c -o isexpired.o isexpired.c
mv -f .deps/hushed.Tpo .deps/hushed.Po
i686-pc-linux-gnu-gcc -DHAVE_CONFIG_H -I. -I.. -I../lib -march=prescott -O2 -pipe -fomit-frame-pointer -MT limits.o -MD -MP -MF .deps/limits.Tpo -c -o limits.o limits.c
mv -f .deps/limits.Tpo .deps/limits.Po
i686-pc-linux-gnu-gcc -DHAVE_CONFIG_H -I. -I.. -I../lib -march=prescott -O2 -pipe -fomit-frame-pointer -MT list.o -MD -MP -MF .deps/list.Tpo -c -o list.o list.c
mv -f .deps/list.Tpo .deps/list.Po
i686-pc-linux-gnu-gcc -DHAVE_CONFIG_H -I. -I.. -I../lib -march=prescott -O2 -pipe -fomit-frame-pointer -MT log.o -MD -MP -MF .deps/log.Tpo -c -o log.o log.c
mv -f .deps/log.Tpo .deps/log.Po
i686-pc-linux-gnu-gcc -DHAVE_CONFIG_H -I. -I.. -I../lib -march=prescott -O2 -pipe -fomit-frame-pointer -MT loginprompt.o -MD -MP -MF .deps/loginprompt.Tpo -c -o loginprompt.o loginprompt.c
mv -f .deps/isexpired.Tpo .deps/isexpired.Po
i686-pc-linux-gnu-gcc -DHAVE_CONFIG_H -I. -I.. -I../lib -march=prescott -O2 -pipe -fomit-frame-pointer -MT mail.o -MD -MP -MF .deps/mail.Tpo -c -o mail.o mail.c
mv -f .deps/mail.Tpo .deps/mail.Po
i686-pc-linux-gnu-gcc -DHAVE_CONFIG_H -I. -I.. -I../lib -march=prescott -O2 -pipe -fomit-frame-pointer -MT motd.o -MD -MP -MF .deps/motd.Tpo -c -o motd.o motd.c
mv -f .deps/motd.Tpo .deps/motd.Po
i686-pc-linux-gnu-gcc -DHAVE_CONFIG_H -I. -I.. -I../lib -march=prescott -O2 -pipe -fomit-frame-pointer -MT myname.o -MD -MP -MF .deps/myname.Tpo -c -o myname.o myname.c
mv -f .deps/myname.Tpo .deps/myname.Po
i686-pc-linux-gnu-gcc -DHAVE_CONFIG_H -I. -I.. -I../lib -march=prescott -O2 -pipe -fomit-frame-pointer -MT obscure.o -MD -MP -MF .deps/obscure.Tpo -c -o obscure.o obscure.c
mv -f .deps/obscure.Tpo .deps/obscure.Po
i686-pc-linux-gnu-gcc -DHAVE_CONFIG_H -I. -I.. -I../lib -march=prescott -O2 -pipe -fomit-frame-pointer -MT pam_pass.o -MD -MP -MF .deps/pam_pass.Tpo -c -o pam_pass.o pam_pass.c
In file included from pam_pass.c:50:
../lib/pam_defs.h:42: ошибка: ‘SHADOW_PAM_CONVERSATION’ не описан в этой области (не в функции)
In file included from pam_pass.c:50:
../lib/pam_defs.h:48:1: warning: "PAM_ESTABLISH_CRED" redefined
In file included from /usr/include/security/pam_appl.h:18,
from ../lib/pam_defs.h:32,
from pam_pass.c:50:
/usr/include/security/_pam_types.h:108:1: warning: this is the location of the previous definition
In file included from pam_pass.c:50:
../lib/pam_defs.h:51:1: warning: "PAM_DELETE_CRED" redefined
In file included from /usr/include/security/pam_appl.h:18,
from ../lib/pam_defs.h:32,
from pam_pass.c:50:
/usr/include/security/_pam_types.h:111:1: warning: this is the location of the previous definition
In file included from pam_pass.c:50:
../lib/pam_defs.h:54:1: warning: "PAM_NEW_AUTHTOK_REQD" redefined
In file included from /usr/include/security/pam_appl.h:18,
from ../lib/pam_defs.h:32,
from pam_pass.c:50:
/usr/include/security/_pam_types.h:49:1: warning: this is the location of the previous definition
In file included from pam_pass.c:50:
../lib/pam_defs.h:57:1: warning: "PAM_DATA_SILENT" redefined
In file included from /usr/include/security/pam_appl.h:18,
from ../lib/pam_defs.h:32,
from pam_pass.c:50:
/usr/include/security/_pam_types.h:199:1: warning: this is the location of the previous definition
make[2]: *** [pam_pass.o] Ошибка 1
make[2]: *** Ожидание завершения заданий...
mv -f .deps/getdate.Tpo .deps/getdate.Po
mv -f .deps/loginprompt.Tpo .deps/loginprompt.Po
make[2]: Leaving directory `/var/tmp/portage/sys-apps/shadow-4.1.2.2/work/shadow-4.1.2.2/libmisc'
make[1]: *** [all-recursive] Ошибка 1
make[1]: Leaving directory `/var/tmp/portage/sys-apps/shadow-4.1.2.2/work/shadow-4.1.2.2'
make: *** [all] Ошибка 2
*
* ERROR: sys-apps/shadow-4.1.2.2 failed.
* Call stack:
* ebuild.sh, line 49: Called src_compile
* environment, line 2672: Called die
* The specific snippet of code:
* emake || die "compile problem"
* The die message:
* compile problem
*
* If you need support, post the topmost build error, and the call stack if relevant.
* A complete build log is located at '/var/tmp/portage/sys-apps/shadow-4.1.2.2/temp/build.log'.
* The ebuild environment file is located at '/var/tmp/portage/sys-apps/shadow-4.1.2.2/temp/environment'.
*
>>> Failed to emerge sys-apps/shadow-4.1.2.2, Log file:
>>> '/var/tmp/portage/sys-apps/shadow-4.1.2.2/temp/build.log'
* Messages for package sys-apps/shadow-4.1.2.2:
*
* ERROR: sys-apps/shadow-4.1.2.2 failed.
* Call stack:
* ebuild.sh, line 49: Called src_compile
* environment, line 2672: Called die
* The specific snippet of code:
* emake || die "compile problem"
* The die message:
* compile problem
*
* If you need support, post the topmost build error, and the call stack if relevant.
* A complete build log is located at '/var/tmp/portage/sys-apps/shadow-4.1.2.2/temp/build.log'.
* The ebuild environment file is located at '/var/tmp/portage/sys-apps/shadow-4.1.2.2/temp/environment'.