ERROR testActivation accounts tests RegistrationTestCase -------------

 1
 2
 3
 4
 5
 6
 7
 8
 9
10
11
12
13
14
15
16
17
18
19
20
21
22
23
24
25
26
27
28
29
30
31
32
33
34
35
36
37
38
39
40
41
42
43
44
45
46
47
48
49
50
51
52
======================================================================
ERROR: testActivation (accounts.tests.RegistrationTestCase)
----------------------------------------------------------------------
Traceback (most recent call last):
File "/web/byteflow/../byteflow/apps/accounts/tests.py", line 14, in setUp
self.em = mail.outbox[0]
IndexError: list index out of range
======================================================================
ERROR: testContentValid (accounts.tests.RegistrationTestCase)
----------------------------------------------------------------------
Traceback (most recent call last):
File "/web/byteflow/../byteflow/apps/accounts/tests.py", line 14, in setUp
self.em = mail.outbox[0]
IndexError: list index out of range
======================================================================
ERROR: testMailExist (accounts.tests.RegistrationTestCase)
----------------------------------------------------------------------
Traceback (most recent call last):
File "/web/byteflow/../byteflow/apps/accounts/tests.py", line 14, in setUp
self.em = mail.outbox[0]
IndexError: list index out of range
======================================================================
ERROR: testSubjectValid (accounts.tests.RegistrationTestCase)
----------------------------------------------------------------------
Traceback (most recent call last):
File "/web/byteflow/../byteflow/apps/accounts/tests.py", line 14, in setUp
self.em = mail.outbox[0]
IndexError: list index out of range
======================================================================
ERROR: testUserCreate (accounts.tests.RegistrationTestCase)
----------------------------------------------------------------------
Traceback (most recent call last):
File "/web/byteflow/../byteflow/apps/accounts/tests.py", line 14, in setUp
self.em = mail.outbox[0]
IndexError: list index out of range
======================================================================
FAIL: testAnonymousComment (blog.tests.PostTestCase)
----------------------------------------------------------------------
Traceback (most recent call last):
File "/web/byteflow/../byteflow/apps/blog/tests.py", line 54, in testAnonymousComment
self.assertEquals(len(mail.outbox), 1)
AssertionError: 0 != 1
----------------------------------------------------------------------
Ran 19 tests in 17.175s
FAILED (failures=1, errors=5)