autogen sh Running aclocal Running autoconf Running libtoolize Running

 1
 2
 3
 4
 5
 6
 7
 8
 9
10
11
12
13
14
15
16
17
18
19
20
21
22
23
24
25
26
27
28
29
30
31
32
33
34
35
36
37
38
39
40
41
42
43
44
45
46
47
48
49
50
51
52
53
54
55
56
57
$ ./autogen.sh
Running aclocal...
Running autoconf...
Running libtoolize...
Running automake...
checking for a BSD-compatible install... /usr/bin/install -c
checking whether build environment is sane... yes
checking for a thread-safe mkdir -p... /bin/mkdir -p
checking for gawk... gawk
checking whether make sets $(MAKE)... yes
checking for gcc... gcc
checking for C compiler default output file name... a.out
checking whether the C compiler works... yes
checking whether we are cross compiling... no
checking for suffix of executables...
checking for suffix of object files... o
checking whether we are using the GNU C compiler... yes
checking whether gcc accepts -g... yes
checking for gcc option to accept ISO C89... none needed
checking for style of include used by make... GNU
checking dependency style of gcc... gcc3
checking for pkg-config... /usr/bin/pkg-config
checking pkg-config is at least version 0.9.0... yes
checking for XCB... yes
checking for XCB_UTIL... yes
checking for LOPS... yes
configure: creating ./config.status
config.status: creating Makefile
config.status: creating src/Makefile
config.status: creating config.h
config.status: config.h is unchanged
config.status: executing depfiles commands
alex@ws22:~/devel/uk$ make
cd . && /bin/bash /home/alex/devel/uk/missing --run autoheader
rm -f stamp-h1
touch config.h.in
cd . && /bin/bash ./config.status config.h
config.status: creating config.h
config.status: config.h is unchanged
make all-recursive
make[1]: Entering directory `/home/alex/devel/uk'
Making all in src
make[2]: Entering directory `/home/alex/devel/uk/src'
gcc -DHAVE_CONFIG_H -I. -I.. -I/usr/local/include -Wall -g -O2 -MT conffile.o -MD -MP -MF .deps/conffile.Tpo -c -o conffile.o conffile.c
mv -f .deps/conffile.Tpo .deps/conffile.Po
gcc -DHAVE_CONFIG_H -I. -I.. -I/usr/local/include -Wall -g -O2 -MT grabkeys.o -MD -MP -MF .deps/grabkeys.Tpo -c -o grabkeys.o grabkeys.c
grabkeys.c: In function ‘run’:
grabkeys.c:46: error: storage size of ‘eh’ isn’t known
grabkeys.c:47: warning: implicit declaration of function ‘xcb_event_handlers_init’
grabkeys.c:48: warning: implicit declaration of function ‘xcb_event_set_key_press_handler’
grabkeys.c:74: warning: implicit declaration of function ‘xcb_event_handle’
grabkeys.c:46: warning: unused variable ‘eh’
make[2]: *** [grabkeys.o] Error 1
make[2]: Leaving directory `/home/alex/devel/uk/src'
make[1]: *** [all-recursive] Error 1
make[1]: Leaving directory `/home/alex/devel/uk'
make: *** [all] Error 2