Performing configure step for libunwind_build autoreconf Entering dire

 1
 2
 3
 4
 5
 6
 7
 8
 9
10
11
12
13
14
15
16
[ 2%] Performing configure step for 'libunwind_build'
autoreconf: Entering directory `.'
autoreconf: configure.ac: not using Gettext
autoreconf: running: aclocal --force
Use of uninitialized value $msg in concatenation (.) or string at /usr/bin/autom4te line 1026.
Use of uninitialized value $stacktrace in pattern match (m//) at /usr/bin/autom4te line 1026.
unknown channel onfigure.ac:170: -1- m4_pattern_allow(^ARCH_TILEGX_TRUE$)
ARCH_X86, test x$target_arch = xx86)
m4trace:c at /usr/share/autoconf/Autom4te/Channels.pm line 638.
Autom4te::Channels::msg('onfigure.ac:170: -1- m4_pattern_allow(^ARCH_TILEGX_TRUE$)\x{a}ARC...', undef, 'warning: ', 'partial', 0) called at /usr/bin/autom4te line 1026
aclocal: error: echo failed with exit status: 1
autoreconf: aclocal failed with exit status: 1
make[2]: *** [bastion_libs/extern/libunwind-1.3.1/bin/src/libunwind_build-stamp/libunwind_build-configure] Ошибка 1
make[1]: *** [bastion_libs/extern/libunwind-1.3.1/CMakeFiles/libunwind_build.dir/all] Ошибка 2
make: *** [all] Ошибка 2
[root@localhost build]#