manage py test Creating test database Creating table auth_permission C

  1
  2
  3
  4
  5
  6
  7
  8
  9
 10
 11
 12
 13
 14
 15
 16
 17
 18
 19
 20
 21
 22
 23
 24
 25
 26
 27
 28
 29
 30
 31
 32
 33
 34
 35
 36
 37
 38
 39
 40
 41
 42
 43
 44
 45
 46
 47
 48
 49
 50
 51
 52
 53
 54
 55
 56
 57
 58
 59
 60
 61
 62
 63
 64
 65
 66
 67
 68
 69
 70
 71
 72
 73
 74
 75
 76
 77
 78
 79
 80
 81
 82
 83
 84
 85
 86
 87
 88
 89
 90
 91
 92
 93
 94
 95
 96
 97
 98
 99
100
101
102
103
104
105
106
107
108
109
110
111
112
113
114
115
116
117
118
119
./manage.py test
Creating test database...
Creating table auth_permission
Creating table auth_group
Creating table auth_user
Creating table auth_message
Creating table django_content_type
Creating table django_session
Creating table django_site
Creating table django_admin_log
Creating table django_flatpage
Creating table actionrecord
Creating table blog_post
Creating table comment_nodes
Creating table tag
Creating table tagged_item
Creating table openidconsumer_nonce
Creating table openidconsumer_association
Creating table openidconsumer_userassociation
Creating table openidserver_oidstorenonce
Creating table openidserver_oidstoreassociation
Creating table openidserver_oidstoresetting
Creating table openidserver_trustedroot
Creating table openidserver_djangoiduser
Creating table pingback
Creating table pingback_client
Creating table pingback_directoryping
Creating table watchlist_subscription
Creating table blogroll_link
Creating table robots_url
Creating table robots_rule
Installing index for auth.Permission model
Installing index for auth.Message model
Installing index for admin.LogEntry model
Installing index for flatpages.FlatPage model
Installing index for accounts.ActionRecord model
Installing index for blog.Post model
Installing index for discussion.CommentNode model
Installing index for tagging.TaggedItem model
Installing index for openidconsumer.UserAssociation model
Installing index for pingback.Pingback model
Installing index for pingback.PingbackClient model
Installing index for pingback.DirectoryPing model
Installing index for watchlist.Subscription model
Installing index for blogroll.Link model
FFFFFF.F.F.......................
======================================================================
FAIL: test_password_change_fails_with_invalid_old_password (django.contrib.auth.tests.views.ChangePasswordTest)
----------------------------------------------------------------------
Traceback (most recent call last):
File "/home/vovaz04h/www/django/contrib/auth/tests/views.py", line 139, in test_password_change_fails_with_invalid_old_password
self.assert_("Your old password was entered incorrectly. Please enter it again." in response.content)
AssertionError
======================================================================
FAIL: test_password_change_fails_with_mismatched_passwords (django.contrib.auth.tests.views.ChangePasswordTest)
----------------------------------------------------------------------
Traceback (most recent call last):
File "/home/vovaz04h/www/django/contrib/auth/tests/views.py", line 150, in test_password_change_fails_with_mismatched_passwords
self.assert_("The two password fields didn't match." in response.content)
AssertionError
======================================================================
FAIL: test_password_change_succeeds (django.contrib.auth.tests.views.ChangePasswordTest)
----------------------------------------------------------------------
Traceback (most recent call last):
File "/home/vovaz04h/www/django/contrib/auth/tests/views.py", line 162, in test_password_change_succeeds
self.fail_login()
File "/home/vovaz04h/www/django/contrib/auth/tests/views.py", line 125, in fail_login
self.assert_("Please enter a correct username and password. Note that both fields are case-sensitive." in response.content)
AssertionError
======================================================================
FAIL: test_confirm_complete (django.contrib.auth.tests.views.PasswordResetTest)
----------------------------------------------------------------------
Traceback (most recent call last):
File "/home/vovaz04h/www/django/contrib/auth/tests/views.py", line 83, in test_confirm_complete
self.assert_("The password reset link was invalid" in response.content)
AssertionError
======================================================================
FAIL: test_confirm_different_passwords (django.contrib.auth.tests.views.PasswordResetTest)
----------------------------------------------------------------------
Traceback (most recent call last):
File "/home/vovaz04h/www/django/contrib/auth/tests/views.py", line 90, in test_confirm_different_passwords
self.assert_("The two password fields didn't match" in response.content)
AssertionError
======================================================================
FAIL: test_confirm_invalid (django.contrib.auth.tests.views.PasswordResetTest)
----------------------------------------------------------------------
Traceback (most recent call last):
File "/home/vovaz04h/www/django/contrib/auth/tests/views.py", line 56, in test_confirm_invalid
self.assert_("The password reset link was invalid" in response.content)
AssertionError
======================================================================
FAIL: test_confirm_valid (django.contrib.auth.tests.views.PasswordResetTest)
----------------------------------------------------------------------
Traceback (most recent call last):
File "/home/vovaz04h/www/django/contrib/auth/tests/views.py", line 46, in test_confirm_valid
self.assert_("Please enter your new password" in response.content)
AssertionError
======================================================================
FAIL: Error is raised if the provided email address isn't currently registered
----------------------------------------------------------------------
Traceback (most recent call last):
File "/home/vovaz04h/www/django/contrib/auth/tests/views.py", line 19, in test_email_not_found
self.assertContains(response, "That e-mail address doesn't have an associated user account")
File "/home/vovaz04h/www/django/test/testcases.py", line 274, in assertContains
"Couldn't find '%s' in response" % text)
AssertionError: Couldn't find 'That e-mail address doesn't have an associated user account' in response
----------------------------------------------------------------------
Ran 33 tests in 51.042s
FAILED (failures=8)
Destroying test database...